{"text_format":"1","workbook":"xlsx","n_sheets":3,"sheets":["K on Soybean SQRT","K on Soybean","K on Rice"],"not_rendered":{"charts":9,"images":5,"macros":1,"external_links":0,"defined_names":21,"comments":3,"pivot_tables":0},"unopened":[],"bounds":{"document_bytes":16777216,"sheet_cells":100000,"rows_first":2000,"rows_last":500,"rows_between":2000,"halvings":0,"cell_chars":16384,"cell_head_chars":4096},"cells_cut":0,"cells_raw":0,"read":"whole","date_system":"1900"}

{"sheet":"K on Soybean SQRT","index":0,"n_rows":548,"n_cols":78,"rows_kept":548,"cut":false,"hidden":true,"merged":[[142,16,142,24],[183,16,183,24],[186,17,187,18]]}
[null,"RELYLD","KRATE","YEAR","SITE","YEAROB","KSOIL","DCLAY"]
[1,90.049140049140036,0,2004,1,1,101,0,null,null,null,null,null,null,null,null,"Rice Price",null,null,null,10,"$/cwt",null,null,"Conventional"]
[2,91.769041769041763,40,2004,1,14,101,0,null,"Dependent Variable: RELYLD",null,null,null,null,null,null,null,null,null,null,null,null,null,null,"Clearfield"]
[3,89.312039312039303,80,2004,1,31,101,0,null,"Method: Panel EGLS (Period random effects)",null,null,null,null,null,null,"Cost of K (0-0-60)",null,null,null,450,"$/ton"]
[4,100,120,2004,1,41,101,0,null,"Date: 03/12/19   Time: 15:57",null,null,null,null,null,null,null,null,null,null,null,null,null,null,"Clay"]
[5,96.928746928746932,160,2004,1,52,101,0,null,"Sample: 2001 2018 IF KRATE<>135",null,null,null,null,null,null,"How much K do you currently apply per acre?",null,null,null,25,"lbs/acre",null,null,"Loam"]
[6,77.508650519031136,0,2004,3,2,85,0,null,"Periods included: 17"]
[7,82.525951557093435,30,2004,3,12,86,0,null,"Cross-sections included: 79",null,null,null,null,null,null,"What yield do you expect at that application rate?",null,null,null,180,"bu/acre",null,null,"Yes"]
[8,100,60,2004,3,23,85,0,null,"Total panel (unbalanced) observations: 440",null,null,null,null,null,null,null,null,null,null,null,null,null,null,"No"]
[9,99.307958477508649,90,2004,3,39,89,0,null,"Wallace and Hussain estimator of component variances",null,null,null,null,null,null,"Do you use conventional or hybrid seed?",null,null,null,"Conventional"]
[10,96.7128027681661,120,2004,3,42,95,0]
[11,69.817073170731717,0,2004,4,3,73,0,null,"Variable","Coefficient","Std. Error","t-Statistic","Prob.  ",null,null,"What is your soil test K?",null,null,null,110]
[12,83.536585365853668,30,2004,4,13,80,0]
[13,87.042682926829272,60,2004,4,24,78,0,null,"C",85.531903931343507,1.0887681974460901,78.5584150345084,1.52334084563578E-257,null,null,"Does the field have mostly clayey or loamy soil texture?",null,null,null,"Loam"]
[14,91.615853658536594,90,2004,4,40,79,0,null,"DRREC",1.8218734362598099,0.61695284893863001,2.9530189209662501,3.3189332097646098E-3]
[15,100,120,2004,4,43,85,0,null,"KRATE",0.15462761258478799,1.68022741166984E-2,9.2027788328436202,1.51928926815474E-18,null,null,"Do you operate South of I-40?",null,null,null,"No"]
[16,74.812030075187963,0,2005,5,1,71,0,null,"KRATE^2",-4.2195811300604799E-4,8.7108479998345494E-5,-4.8440532197790898,1.77718926043751E-6]
[17,84.022556390977442,30,2005,5,12,70,0,null,"DCLFIELD",2.25413928281827,0.92655603374247097,2.4328148549349198,1.5387838751224099E-2,null,null,"Predicted RELYLD based on above questions:",null,null,null,{"$f":"+K14+IF($U$16=\"Yes\",K15,0)+$U$6*($U$12*K21+K16+IF($U$10=\"Clearfield\",K23,0))+$U$6^2*(K17+IF($U$14=\"Clay\",K22))+IF($U$14=\"Clay\",K20,0)+IF($U$10=\"Clearfield\",K18,0)+$U$12*K19","v":93.328781846137147}]
[18,89.473684210526315,60,2005,5,23,81,0,null,"KSOIL",4.8135418919568303E-2,9.6227532755463804E-3,5.0022501399772299,8.2652555394556796E-7]
[19,94.548872180451113,90,2005,5,39,92,0,null,"DCLAY",-3.2678032569792799,1.6364469951037599,-1.99688915483148,4.6465607051286599E-2,null,null,"Yield/RELYLD",null,null,null,{"$f":"+U8/U18","v":1.9286654817454918}]
[20,100,120,2005,5,41,91,0,null,"KSOIL*KRATE",-3.9999442194537998E-4,8.7972098694473307E-5,-4.5468327785899403,7.0861123117113604E-6]
[21,70.805369127516784,0,2005,6,2,65,0,null,"DCLAY*KRATE^2",null,null,null,null,null,null,"dRELYLD/dKRATE",null,null,null,{"$f":"+K16+U12*K21+IF(U10=\"Clearfield\",K23,0)+2*U6*(K17+IF(U14=\"Clay\",K22))","v":8.9530320520493797E-2},null,{"$f":"+K16+U12*K21+IF(U10=\"Clearfield\",K23,0)+2*U28*(K17+IF(U14=\"Clay\",K22))","v":4.3164561603838428E-2}]
[22,81.040268456375827,30,2005,6,13,68,0,null,"DCLFIELD*KRATE",-2.08785687496169E-2,9.5664735416848001E-3,-2.1824728473497501,2.96137948544343E-2]
[23,94.630872483221466,60,2005,6,24,63,0,null,null,null,null,null,null,null,null,{"$f":"CONCATENATE(\"VMP of K @ KRATE =  \",U6,\" lbs/acre and soil test K of \",U12)","v":"VMP of K @ KRATE =  25 lbs/acre and soil test K of 110"},null,null,null,{"$f":"+U22*U2/2.22*U20","v":0.77781098539408311},null,{"$f":"+W22*U2/2.22*U20","v":0.37499999999999994}]
[24,92.785234899328856,90,2005,6,40,83,0,null,null,"Effects Specification"]
[25,100,120,2005,6,42,79,0,null,null,null,null,"S.D.  ","Rho  ",null,null,"Cost per lb of K",null,null,null,{"$f":"+U4/0.6/2000","v":0.375}]
[26,96.963946869070199,0,2005,8,3,154,0]
[27,100,40,2005,8,14,154,0,null,"Period random",null,null,1.0600971748826,4.7688267843004797E-2,null,null,"Profit Maximizing K rate:",null,null,null,{"$f":"IF((U26/(U2/2.22*U20)-(K16+U12*K21+IF(U10=\"Clearfield\",K23,0)))/(2*(K17+IF(U14=\"Clay\",K22)))>180,180,(U26/(U2/2.22*U20)-(K16+U12*K21+IF(U10=\"Clearfield\",K23,0)))/(2*(K17+IF(U14=\"Clay\",K22))))","v":79.941186681236772},null,125,"Alt User K"]
[28,98.861480075901326,80,2005,8,31,154,0,null,"Idiosyncratic random",null,null,4.7372845346977401,0.95231173215699505]
[29,94.307400379506646,120,2005,8,43,154,0,null,null,null,null,null,null,null,null,"Expected Yield at Profit-Maximizing K rate:",null,null,null,{"$f":"(+K14+IF(U16=\"Yes\",K15,0)+U28*(U12*K21+K16+IF(U10=\"Clearfield\",K23,0))+U28^2*(K17+IF(U14=\"Clay\",K22))+IF(U14=\"Clay\",K20,0)+IF(U10=\"Clearfield\",K18,0)+U12*K19)*U20","v":187.03038519479557},null,{"$f":"(+K14+IF(U16=\"Yes\",K15,0)+W28*(U12*K21+K16+IF(U10=\"Clearfield\",K23,0))+W28^2*(K17+IF(U14=\"Clay\",K22))+IF(U14=\"Clay\",K20,0)+IF(U10=\"Clearfield\",K18,0)+U12*K19)*U20","v":189.12924340277638}]
[30,99.240986717267546,160,2005,8,52,154,0,null,null,"Weighted Statistics"]
[31,77.477477477477478,0,2005,9,4,72,1,null,null,null,null,null,null,null,null,"Added Profit in $/acre",null,null,null,{"$f":"+(U30-U8)*U2/2.22-(U28-U6)*U26","v":11.065456772894635},null,{"$f":"+(W30-U8)*U2/2.22-(W28-U6)*U26","v":3.6227180305242399}]
[32,85.585585585585591,40,2005,9,15,72,1,null,"R-squared",0.29544205258799699,"    Mean dependent var",null,60.432687873492299]
[33,97.837837837837839,80,2005,9,32,72,1,null,"Adjusted R-squared",0.28236441087269298,"    S.D. dependent var",null,9.8841223268864802,null,null,null,null,null,null,null,null,null,null,null,null,null,null,null,null,null,null,null,null,null,null,null,null,null,null,null,null,null,null,null,null,null,null,null,null,null,null,null,null,null,null,null,null,null,"K rate","Exp. Yield"]
[34,98.738738738738732,120,2005,9,44,72,1,null,"S.E. of regression",4.7439141955850399,"    Sum squared resid",null,9699.5351367765797,null,null,null,null,null,null,null,null,null,null,null,null,null,null,null,null,null,null,null,null,null,null,null,null,null,null,null,null,null,null,null,null,null,null,null,null,null,null,null,null,null,null,null,null,null,0,{"$f":"(+$K$14+IF($U$16=\"Yes\",$K$15,0)+BH35*($U$12*$K$21+$K$16+IF($U$10=\"Clearfield\",$K$23,0))+BH35^2*($K$17+IF($U$14=\"Clay\",$K$22))+IF($U$14=\"Clay\",$K$20,0)+IF($U$10=\"Clearfield\",$K$18,0)+$U$12*$K$19)*$U$20","v":175.17451400150208}]
[35,100,160,2005,9,53,72,1,null,"F-statistic",22.591386048010399,"    Durbin-Watson stat",null,2.4906446401097999,null,null,null,null,null,null,null,null,null,null,null,null,null,null,null,null,null,null,null,null,null,null,null,null,null,null,null,null,null,null,null,null,null,null,null,null,null,null,null,null,null,null,null,null,null,10,{"$f":"(+$K$14+IF($U$16=\"Yes\",$K$15,0)+BH36*($U$12*$K$21+$K$16+IF($U$10=\"Clearfield\",$K$23,0))+BH36^2*($K$17+IF($U$14=\"Clay\",$K$22))+IF($U$14=\"Clay\",$K$20,0)+IF($U$10=\"Clearfield\",$K$18,0)+$U$12*$K$19)*$U$20","v":177.22678080799585}]
[36,94.126284875183558,0,2005,10,5,167,0,null,"Prob(F-statistic)",7.6933271621005695E-29,null,null,null,null,null,null,null,null,null,null,null,null,null,null,null,null,null,null,null,null,null,null,null,null,null,null,null,null,null,null,null,null,null,null,null,null,null,null,null,null,null,null,null,null,null,null,null,null,20,179.11628440503014]
[37,94.713656387665196,40,2005,10,16,167,0,null,null,null,null,null,null,null,null,null,null,null,null,null,null,null,null,null,null,null,null,null,null,null,null,null,null,null,null,null,null,null,null,null,null,null,null,null,null,null,null,null,null,null,null,null,null,null,null,null,null,null,30,180.84302479260501]
[38,97.650513950073432,80,2005,10,33,167,0,null,null,"Unweighted Statistics",null,null,null,null,null,null,null,null,null,null,null,null,null,null,null,null,null,null,null,null,null,null,null,null,null,null,null,null,null,null,null,null,null,null,null,null,null,null,null,null,null,null,null,null,null,null,null,null,40,182.40700197072042]
[39,99.853157121879605,120,2005,10,45,167,0,null,null,null,null,null,null,null,null,null,null,null,null,null,null,null,null,null,null,null,null,null,null,null,null,null,null,null,null,null,null,null,null,null,null,null,null,null,null,null,null,null,null,null,null,null,null,null,null,null,null,null,50,183.80821593937642]
[40,100,160,2005,10,54,167,0,null,"R-squared",0.29611730962803401,"    Mean dependent var",null,95.920454545454504,null,null,null,null,null,null,null,null,null,null,null,null,null,null,null,null,null,null,null,null,null,null,null,null,null,null,null,null,null,null,null,null,null,null,null,null,null,null,null,null,null,null,null,null,null,60,185.04666669857292]
[41,92.028985507246361,0,2005,12,6,108,0,null,"Sum squared resid",10114.186042011301,"    Durbin-Watson stat",null,2.48242050670396,null,null,null,null,null,null,null,null,null,null,null,null,null,null,null,null,null,null,null,null,null,null,null,null,null,null,null,null,null,null,null,null,null,null,null,null,null,null,null,null,null,null,null,null,null,70,186.12235424831002]
[42,94.565217391304344,40,2005,12,17,108,0,null,null,null,null,null,null,null,null,null,null,null,null,null,null,null,null,null,null,null,null,null,null,null,null,null,null,null,null,null,null,null,null,null,null,null,null,null,null,null,null,null,null,null,null,null,null,null,null,null,null,null,80,187.03527858858763]
[43,99.094202898550719,80,2005,12,34,108,0,null,null,null,null,null,null,null,null,null,null,null,null,null,null,null,null,null,null,null,null,null,null,null,null,null,null,null,null,null,null,null,null,null,null,null,null,null,null,null,null,null,null,null,null,null,null,null,null,null,null,null,90,187.78543971940584]
[44,79.891304347826093,120,2005,12,46,108,0,null,null,null,null,null,null,null,null,null,null,null,null,null,null,null,null,null,null,null,null,null,null,null,null,null,null,null,null,null,null,null,null,null,null,null,null,null,null,null,null,null,null,null,null,null,null,null,null,null,null,null,100,188.3728376407646]
[45,100,160,2005,12,55,108,0,null,null,null,null,null,null,null,null,null,null,null,null,null,null,null,null,null,null,null,null,null,null,null,null,null,null,null,null,null,null,null,null,null,null,null,null,null,null,null,null,null,null,null,null,null,null,null,null,null,null,null,110,188.7974723526639]
[46,88.083735909822863,0,2006,13,1,102,0,null,null,null,null,{"$f":"174/192","v":0.90625},null,null,null,null,null,null,null,null,null,null,null,null,null,null,null,null,null,null,null,null,null,null,null,null,null,null,null,null,null,null,null,null,null,null,null,null,null,null,null,null,null,null,null,null,null,null,120,189.05934385510372]
[47,91.143317230273752,40,2006,13,14,102,0,null,null,null,null,null,null,null,null,null,null,null,null,null,null,null,null,null,null,null,null,null,null,null,null,null,null,null,null,null,null,null,null,null,null,null,null,null,null,null,null,null,null,null,null,null,null,null,null,null,null,null,130,189.15845214808414]
[48,100,80,2006,13,31,102,0,null,null,null,null,null,null,null,null,null,null,null,null,null,null,null,null,null,null,null,null,null,null,null,null,null,null,null,null,null,null,null,null,null,null,null,null,null,null,null,null,null,null,null,null,null,null,null,null,null,null,null,140,189.09479723160507]
[49,99.838969404186798,120,2006,13,41,102,0,null,null,null,null,null,null,null,null,null,null,null,null,null,null,null,null,null,null,null,null,null,null,null,null,null,null,null,null,null,null,null,null,null,null,null,null,null,null,null,null,null,null,null,null,null,null,null,null,null,null,null,150,188.86837910566663]
[50,98.711755233494358,160,2006,13,52,102,0,null,null,null,null,null,null,null,null,null,null,null,null,null,null,null,null,null,null,null,null,null,null,null,null,null,null,null,null,null,null,null,null,null,null,null,null,null,null,null,null,null,null,null,null,null,null,null,null,null,null,null,160,188.47919777026871]
[51,92.508710801393732,0,2006,14,2,104,0,null,null,null,null,null,null,null,null,null,null,null,null,null,null,null,null,null,null,null,null,null,null,null,null,null,null,null,null,null,null,null,null,null,null,null,null,null,null,null,null,null,null,null,null,null,null,null,null,null,null,null,170,187.92725322541133]
[52,95.470383275261312,40,2006,14,15,104,0,null,null,null,null,null,null,null,null,null,null,null,null,null,null,null,null,null,null,null,null,null,null,null,null,null,null,null,null,null,null,null,null,null,null,null,null,null,null,null,null,null,null,null,null,null,null,null,null,null,null,null,180,187.2125454710945]
[53,95.470383275261312,80,2006,14,32,104,0]
[54,99.303135888501743,120,2006,14,42,104,0]
[55,100,160,2006,14,53,104,0]
[56,96.847414880201768,0,2006,15,3,154,0]
[57,94.829760403530912,40,2006,15,16,154,0,null,"Dependent Variable: RELYLD",null,null,null,null,null,null,"Predicted RELYLD based on above questions:",null,null,null,{"$f":"+K69+IF($U$16=\"Yes\",K70,0)+$U$6*($U$12*K76+K71+IF($U$10=\"Clearfield\",K77,0)+IF($U$14=\"Clay\",K78))+$U$6^0.5*K72+IF($U$14=\"Clay\",K75,0)+IF($U$10=\"Clearfield\",K73,0)+$U$12*K74","v":94.566945198811538}]
[58,98.738965952080704,80,2006,15,33,154,0,null,"Method: Panel EGLS (Period random effects)"]
[59,100,120,2006,15,43,154,0,null,"Date: 03/13/19   Time: 09:12",null,null,null,null,null,null,"Yield/RELYLD",null,null,null,{"$f":"+U8/U58","v":1.9034134984648117}]
[60,94.955863808322832,160,2006,15,54,154,0,null,"Sample: 2001 2018 IF KRATE<>135"]
[61,73.731343283582078,0,2006,17,4,86,0,null,"Periods included: 17",null,null,null,null,null,null,"dRELYLD/dKRATE",null,null,null,{"$f":"+K71+U12*K76+IF(U10=\"Clearfield\",K77,0)+IF(U14=\"Clay\",K78,0)+0.5*U6^-0.5*K72","v":5.9615107453487554E-2},null,{"$f":"+K71+U12*K76+IF(U10=\"Clearfield\",K77,0)+IF(U14=\"Clay\",K78,0)+0.5*U68^-0.5*K72","v":4.3737212154450339E-2}]
[62,82.388059701492551,40,2006,17,17,86,0,null,"Cross-sections included: 79"]
[63,93.28358208955224,80,2006,17,34,86,0,null,"Total panel (unbalanced) observations: 440",null,null,null,null,null,null,{"$f":"CONCATENATE(\"VMP of K @ KRATE =  \",U6,\" lbs/acre and soil test K of \",U12)","v":"VMP of K @ KRATE =  25 lbs/acre and soil test K of 110"},null,null,null,{"$f":"+U62*U2/2.22*U60","v":0.51113603711440714},null,{"$f":"+W62*U2/2.22*U60","v":0.37499999999999994}]
[64,98.208955223880594,120,2006,17,44,86,0,null,"Wallace and Hussain estimator of component variances"]
[65,100,160,2006,17,55,86,0,null,null,null,null,null,null,null,null,"Cost per lb of K",null,null,null,{"$f":"+U4/0.6/2000","v":0.375},null,{"$f":"(K71+U12*K76+IF(U10=\"Clearfield\",K77,0)+IF(U14=\"Clay\",K78)+0.5*W68^-0.5*K72)*U2/2.22*U60","v":1.3839809839067578},"VMP at Alt User K"]
[66,79.685039370078741,0,2006,20,5,103,0,null,"Variable","Coefficient","Std. Error","t-Statistic","Prob.  "]
[67,87.559055118110237,40,2006,20,18,108,0,null,null,null,null,null,null,null,null,"Optimal K",null,null,null,{"$f":"IF(((U66/(U2/2.22*U60)-(K71+U12*K76+IF(U10=\"Clearfield\",K77,0)+IF(U14=\"Clay\",K78,0)))*2/K72)^-2>180,180,((U66/(U2/2.22*U60)-(K71+U12*K76+IF(U10=\"Clearfield\",K77,0)+IF(U14=\"Clay\",K78,0)))*2/K72)^-2)","v":38.367544561875619},null,5,"Alt User K"]
[68,92.755905511811022,80,2006,20,35,118,0,null,"C",83.578024194847401,1.20659577850463,69.267625234383004,2.2750956979676501E-235]
[69,100,120,2006,20,45,131,0,null,"DRREC",1.90137269172526,0.611207364620451,3.1108471556228299,1.9897376464522699E-3,null,null,"Expected Yield",null,null,null,{"$f":"(+K69+IF(U16=\"Yes\",K70,0)+U68*(K71+IF(U10=\"Clearfield\",K77,0)+IF(U14=\"Clay\",K78,0)+U12*K76)+U68^0.5*(K72)+IF(U14=\"Clay\",K75,0)+IF(U10=\"Clearfield\",K73,0)+U12*K74)*U60","v":181.29329790088903},null,{"$f":"(K69+IF($U$16=\"Yes\",K70,0)+$W$68*($U$12*K76+K71+IF($U$10=\"Clearfield\",K77,0)+IF($U$14=\"Clay\",K78,0))+$W$68^0.5*K72+IF($U$14=\"Clay\",K75,0)+IF($U$10=\"Clearfield\",K73,0)+$U$12*K74)*U60","v":176.53298178147375}]
[70,94.803149606299215,160,2006,20,56,133,0,null,"KRATE",5.52742460889597E-2,1.9451119658015902E-2,2.8416999669312499,4.7008195051331499E-3]
[71,77.483443708609272,0,2006,21,6,96,0,null,"KRATE^.5",0.82359665888312805,0.17954385041366799,4.5871616153132599,5.9022854645111403E-6,null,null,"Added Profit in $/acre",null,null,null,{"$f":"+(U70-U8)*U2/2.22-(U68-U6)*U66","v":0.81283700951749793},null,{"$f":"+(W70-U8)*U2/2.22-(W68-U6)*U66","v":-8.1171991825506691}]
[72,85.099337748344368,40,2006,21,19,95,0,null,"DCLFIELD",2.3332614357395598,0.91706877676773202,2.5442600324517501,1.1299725801368E-2]
[73,92.549668874172184,80,2006,21,36,94,0,null,"KSOIL",6.7632287912901295E-2,1.0982638763412E-2,6.15810911838543,1.69129017958203E-9]
[74,97.847682119205302,120,2006,21,46,111,0,null,"DCLAY",-9.2966107938057601,2.44179543787327,-3.80728485671299,1.60919576848023E-4]
[75,100,160,2006,21,57,123,0,null,"KSOIL*KRATE",-7.0926185930713596E-4,1.2399222892968301E-4,-5.7202121893410096,1.9952072499410899E-8,null,null,"K rate","Exp. Yield"]
[76,64.688427299703264,0,2007,22,1,60,0,null,"DCLFIELD*KRATE",-2.1130216011934499E-2,9.4468218525947407E-3,-2.2367539413406701,2.5814344277088699E-2,null,null,0.01,{"$f":"(+$K$69+IF($U$16=\"Yes\",$K$70,0)+Q77*($U$12*$K$76+$K$71+IF($U$10=\"Clearfield\",$K$77,0)+IF($U$14=\"Clay\",$K$78,0))+Q77^0.5*($K$72)+IF($U$14=\"Clay\",$K$75,0)+IF($U$10=\"Clearfield\",$K$73,0)+$U$12*$K$74)*$U$60","v":173.40041407627885}]
[77,86.646884272997028,40,2007,22,14,72,0,null,"DCLAY*KRATE",9.2406560478107802E-2,2.7666102147056101E-2,3.3400643136113199,9.1062959029147102E-4,null,null,2,175.37448271729784]
[78,89.910979228486639,80,2007,22,31,78,0,null,null,null,null,null,null,null,null,7,177.08863521093923]
[79,100,120,2007,22,41,81,0,null,null,"Effects Specification",null,null,null,null,null,15,178.66616097564972]
[80,92.284866468842736,160,2007,22,52,96,0,null,null,null,null,"S.D.  ","Rho  ",null,null,25,180]
[81,65.507649513212797,0,2007,23,2,71,0,null,null,null,null,null,null,null,null,45,181.81201135919036]
[82,91.098748261474256,40,2007,23,15,67,0,null,"Period random",null,null,1.09988001926412,5.2379790785103401E-2,null,null,60,182.78947046556192]
[83,94.019471488178013,80,2007,23,32,72,0,null,"Idiosyncratic random",null,null,4.6782194465974003,0.94762020921489598,null,null,70,183.3294805862167]
[84,92.628650904033364,120,2007,23,42,78,0,null,null,null,null,null,null,null,null,80,183.80214165492671]
[85,100,160,2007,23,53,97,0,null,null,"Weighted Statistics",null,null,null,null,null,90,184.21976180769644]
[86,82.853025936599408,0,2007,24,3,113,0,null,null,null,null,null,null,null,null,100,184.59130252343323]
[87,92.939481268011519,40,2007,24,16,113,0,null,"R-squared",0.31310372894456001,"    Mean dependent var",null,58.6943381945228,null,null,110,184.92352899484598]
[88,91.642651296829968,80,2007,24,33,113,0,null,"Adjusted R-squared",0.29872683024805102,"    S.D. dependent var",null,10.0022922776174,null,null,120,185.22169710371608]
[89,100,120,2007,24,43,113,0,null,"S.E. of regression",4.6850694834181299,"    Sum squared resid",null,9438.4467077160407,null,null,130,185.48998657691288]
[90,91.930835734870314,160,2007,24,54,113,0,null,"F-statistic",21.778252428013801,"    Durbin-Watson stat",null,2.4409488046449499,null,null,140,185.73178632091404]
[91,92.43027888446214,0,2007,26,4,102,0,null,"Prob(F-statistic)",1.97587979995919E-30,null,null,null,null,null,150,185.94988928056159]
[92,96.215139442231063,40,2007,26,17,102,0,null,null,null,null,null,null,null,null,160,186.14662959543867]
[93,100,80,2007,26,34,102,0,null,null,"Unweighted Statistics",null,null,null,null,null,170,186.32398165788015]
[94,95.019920318725099,120,2007,26,44,102,0,null,null,null,null,null,null,null,null,180,186.48363326015524]
[95,94.223107569721108,160,2007,26,55,102,0,null,"R-squared",0.31196952181203802,"    Mean dependent var",null,95.920454545454504]
[96,87.732342007434951,0,2007,27,5,139,0,null,"Sum squared resid",9886.4034506796197,"    Durbin-Watson stat",null,2.4312777860733799]
[97,88.847583643122675,40,2007,27,18,139,0]
[98,100,80,2007,27,35,139,0]
[99,94.423791821561338,120,2007,27,45,139,0]
[100,91.44981412639406,160,2007,27,56,139,0,null,"Dependent Variable: RELYLD",null,null,null,null,null,null,"Predicted RELYLD based on above questions:",null,null,null,{"$f":"+K112+IF($U$16=\"Yes\",K113,0)+LN($U$6)*(K117+$U$12*K120+IF($U$10=\"Clearfield\",K119,0)+IF($U$14=\"Clay\",K118))+IF($U$14=\"Clay\",K116,0)+IF($U$10=\"Clearfield\",K114,0)+$U$12*K115","v":96.183932265481602}]
[101,90.236220472440948,0,2007,28,6,272,1,null,"Method: Panel EGLS (Period random effects)"]
[102,100,40,2007,28,19,272,1,null,"Date: 03/13/19   Time: 16:57",null,null,null,null,null,null,"Yield/RELYLD",null,null,null,{"$f":"+U8/U101","v":1.871414442728063}]
[103,91.338582677165363,80,2007,28,36,272,1,null,"Sample: 2001 2018 IF KRATE<>135"]
[104,91.496062992125985,120,2007,28,46,272,1,null,"Periods included: 17",null,null,null,null,null,null,"dRELYLD/dKRATE",null,null,null,{"$f":"(K117+IF(U14=\"Clay\",K118,0)+IF(U10=\"Clearfield\",K119,0)+U12*K120)/U6","v":1.7019495542632695E-2},null,{"$f":"(K117+IF(U14=\"Clay\",K118,0)+IF(U10=\"Clearfield\",K119,0)+U12*K120)/U111","v":4.4485068672785247E-2}]
[105,93.228346456692918,160,2007,28,57,272,1,null,"Cross-sections included: 79"]
[106,90.354330708661422,0,2007,30,7,94,0,null,"Total panel (unbalanced) observations: 440",null,null,null,null,null,null,{"$f":"CONCATENATE(\"VMP of K @ KRATE =  \",U49,\" lbs/acre and soil test K of \",U55)","v":"VMP of K @ KRATE =   lbs/acre and soil test K of "},null,null,null,{"$f":"+U105*U2/2.22*U103","v":0.14347085480373295},null,{"$f":"+W105*U2/2.22*U103","v":0.37500000000000006}]
[107,97.440944881889763,40,2007,30,20,94,0,null,"Wallace and Hussain estimator of component variances"]
[108,100,80,2007,30,37,94,0,null,null,null,null,null,null,null,null,"Cost per lb of K",null,null,null,{"$f":"+U4/0.6/2000","v":0.375},null,{"$f":"(K117+IF(U14=\"Clay\",K118,0)+IF(U10=\"Clearfield\",K119,0)+U12*K120)/W111*U2/2.22*U103","v":0.71735427401866481},"VMP at Alt User K"]
[109,96.653543307086622,120,2007,30,47,94,0,null,"Variable","Coefficient","Std. Error","t-Statistic","Prob.  "]
[110,93.30708661417323,160,2007,30,58,94,0,null,null,null,null,null,null,null,null,"Optimal K",null,null,null,{"$f":"IF(((K117+IF(U14=\"Clay\",K118,0)+IF(U10=\"Clearfield\",K119,0)+U12*K120)/(U109/(U2/2.22*U103)))>180,180,((K117+IF(U14=\"Clay\",K118,0)+IF(U10=\"Clearfield\",K119,0)+U12*K120)/(U109/(U2/2.22*U103))))","v":9.5647236535821953},null,5,"Alt User K"]
[111,91.946308724832221,0,2007,31,8,94,0,null,"C",92.048356264197906,0.81185646957784696,113.380085906147,0]
[112,96.510067114093971,40,2007,31,21,94,0,null,"DRREC",1.6742729270431,0.62470994594087303,2.6800804724206602,7.6425083668557299E-3,null,null,"Expected Yield",null,null,null,{"$f":"(+K112+IF(U16=\"Yes\",K113,0)+LN(U111)*(K117+IF(U10=\"Clearfield\",K119,0)+IF(U14=\"Clay\",K118,0)+U12*K120)+IF(U14=\"Clay\",K116,0)+IF(U10=\"Clearfield\",K114,0)+U12*K115)*U103","v":179.23495496196571},null,{"$f":"(+K112+IF(U16=\"Yes\",K113,0)+LN(W111)*(K117+IF(U10=\"Clearfield\",K119,0)+IF(U14=\"Clay\",K118,0)+U12*K120)+IF(U14=\"Clay\",K116,0)+IF(U10=\"Clearfield\",K114,0)+U12*K115)*U103","v":178.71846374657}]
[113,100,80,2007,31,38,94,0,null,"DCLFIELD",0.95387617661894897,0.59935237500280203,1.5915114653787601,0.11222766173396501]
[114,92.080536912751668,120,2007,31,48,94,0,null,"KSOIL",2.5145317567662698E-2,7.9073504817691407E-3,3.179992796024,1.57907971855337E-3,null,null,"Added Profit in $/acre",null,null,null,{"$f":"+(U113-U8)*U2/2.22-(U111-U6)*U109","v":2.3420798099324087},null,{"$f":"+(W113-U8)*U2/2.22-(W111-U6)*U109","v":1.7273141737387165}]
[115,97.181208053691279,160,2007,31,59,94,0,null,"DCLAY",-3.4884119486487601,1.6463808393911099,-2.1188365809328,3.4675694186571397E-2]
[116,91.58620689655173,0,2008,32,1,125,0,null,"LNK",0.94669112850294701,0.118705368908325,7.9751331991905596,1.38311928799235E-14]
[117,95.724137931034491,40,2008,32,14,125,0,null,"LNK*DCLAY",0.49900023733202897,0.24385593113290899,2.0462911646797601,4.1333966755333698E-2,null,null,"K rate","Exp. Yield"]
[118,98.482758620689665,80,2008,32,31,125,0,null,"LNK*DCLFIELD",-0.14964556390544001,9.1935393442375696E-2,-1.6277252786135701,0.10431391173181299,null,null,0.01,{"$f":"(+$K$112+IF($U$16=\"Yes\",$K$113,0)+LN(Q119)*($K$117+IF($U$10=\"Clearfield\",$K$119,0)+IF($U$14=\"Clay\",$K$118,0)+$U$12*$K$120)+IF($U$14=\"Clay\",$K$116,0)+IF($U$10=\"Clearfield\",$K$114,0)+$U$12*$K$115)*$U$103","v":173.76999974093286}]
[119,96.827586206896555,120,2008,32,41,125,0,null,"LNK*KSOIL",-4.7382158176102699E-3,1.1344859832762E-3,-4.17653094657644,3.5839426616793697E-5,null,null,2,177.98885511581346]
[120,100,160,2008,32,52,125,0,null,null,null,null,null,null,null,null,5,178.71846374657]
[121,89.617486338797804,0,2008,33,2,114,0,null,null,"Effects Specification",null,null,null,null,null,7,178.986384221272]
[122,91.666666666666657,40,2008,33,15,114,0,null,null,null,null,"S.D.  ","Rho  ",null,null,10,179.2703913692435]
[123,87.295081967213108,80,2008,33,32,114,0,null,null,null,null,null,null,null,null,15,179.59324833161969]
[124,98.360655737704917,120,2008,33,42,114,0,null,"Period random",null,null,1.1064707345190701,5.0323337690711199E-2,null,null,30,180.14517595429319]
[125,100,160,2008,33,53,114,0,null,"Idiosyncratic random",null,null,4.8066565925013904,0.94967666230928804,null,null,50,180.55192762267356]
[126,88.41379310344827,0,2008,34,3,87,0,null,null,null,null,null,null,null,null,70,180.81984809737557]
[127,95.724137931034491,40,2008,34,16,87,0,null,null,"Weighted Statistics",null,null,null,null,null,90,181.01996053934292]
[128,98.482758620689665,80,2008,34,33,87,0,null,null,null,null,null,null,null,null,100,181.10385524534706]
[129,96.827586206896555,120,2008,34,43,87,0,null,"R-squared",0.27404288091336698,"    Mean dependent var",null,59.438929627391701,null,null,110,181.17974723831961]
[130,100,160,2008,34,54,87,0,null,"Adjusted R-squared",0.26056803879575002,"    S.D. dependent var",null,9.9541078865655201,null,null,120,181.24903119964026]
[131,100,0,2008,35,4,155,0,null,"S.E. of regression",4.8127962685283698,"    Sum squared resid",null,9983.2564145374308,null,null,130,181.31276626572378]
[132,100,40,2008,35,17,155,0,null,"F-statistic",20.337372306208898,"    Durbin-Watson stat",null,2.37121624282072,null,null,140,181.37177572004907]
[133,98.61351819757364,80,2008,35,34,155,0,null,"Prob(F-statistic)",3.8906473912959599E-26,null,null,null,null,null,150,181.42671220772326]
[134,100,120,2008,35,44,155,0,null,null,null,null,null,null,null,null,160,181.47810185993757]
[135,98.266897746967075,160,2008,35,55,155,0,null,null,"Unweighted Statistics",null,null,null,null,null,170,181.52637501798117]
[136,81.415929203539832,0,2008,38,5,110,0,null,null,null,null,null,null,null,null,180,181.57188816201642]
[137,100,40,2008,38,18,113,0,null,"R-squared",0.27346398363038699,"    Mean dependent var",null,95.920454545454504]
[138,99.705014749262531,80,2008,38,35,113,0,null,"Sum squared resid",10439.6947620644,"    Durbin-Watson stat",null,2.36409625502798]
[139,97.197640117994112,120,2008,38,45,133,0]
[140,100,160,2008,38,56,147,0]
[141,95.5,0,2009,39,1,102,0,null,null,null,null,null,null,null,null,null,null,null,null,null,null,true]
[142,98.333333333333329,45,2009,39,22,102,0,null,{"$f":"0.8301513*2.47105*0.453592","v":0.93047384900780505},null,null,null,null,null,null,"Profit-Maximizing K Rate Calculator"]
[143,100,90,2009,39,39,102,0]
[144,90.676691729323295,0,2009,42,2,98,0,null,"Dependent Variable: RY",null,null,null,null,null,null,"What is your expected soybean price?",null,null,null,0.39939741328630213,{"$f":"IF(W142,CONCATENATE(\"$ kg\",Z155),\"$/bu\")","v":"$ kg⁻¹"}]
[145,100,60,2009,42,23,98,0,null,"Method: Panel EGLS (Period random effects)"]
[146,88.571428571428569,120,2009,42,41,98,0,null,"Date: 06/03/20   Time: 12:34",null,null,null,null,null,null,"What do you expect to pay for muriate of potash fertilizer?",null,null,null,512.56613756613751,{"$f":"IF(W142,CONCATENATE(\"$ Mg\",Z155),\"$/ton\")","v":"$ Mg⁻¹"},{"$f":"+U147/IF(W142,1000,2000)/IF(W142,0.49809078131038,0.6)","v":1.0290616827271442},{"$f":"IF(W142,CONCATENATE(\"$ kg\",Z155,\" K\"),CONCATENATE(\"$/lb of K\",Z153,\"O\"))","v":"$ kg⁻¹ K"}]
[147,99.072642967542492,0,2009,43,3,104,0,null,"Sample: 2004 2019"]
[148,100,60,2009,43,24,104,0,null,"Periods included: 16",null,null,null,null,null,null,"What is the yield potential of your field?",null,null,null,4219,{"$f":"IF(W142,CONCATENATE(\"kg ha\",Z155),\"bu/acre\")","v":"kg ha⁻¹"},{"$f":"+U149/100","v":42.19},"kg ha-1/relative yield % (100% = yield potential)",{"$f":"180*IF(W142,BP172,1)","v":167.49163620904244},"Max. Fert applied per acre in the experiment"]
[149,95.672333848531679,120,2009,43,42,104,0,null,"Cross-sections included: 59",null,null,null,null,null,null,null,null,null,null,null,null,null,null,null,null,null,null,null,null,null,null,null,null,null,null,null,null,null,null,null,null,null,null,null,null,null,null,null,null,null,null,null,null,null,null,null,null,null,null,null,null,null,null,null,null,null,null,null,null,null,null,null,"Labels"]
[150,86.771653543307096,0,2009,44,4,84,0,null,"Total panel (unbalanced) observations: 374",null,null,null,null,null,null,"What is your soil-test K value (STK) and range?",null,null,null,113,{"$f":"IF(W142,CONCATENATE(\"mg K kg\",Z155),\"ppm\")","v":"mg K kg⁻¹"},"Soil test range +/-",null,10,null,null,null,null,null,null,null,null,null,null,null,null,null,null,null,null,null,null,null,null,null,null,null,null,null,null,null,null,null,null,null,null,null,null,null,"High",{"$f":"MMULT($BJ$157:$BO$157,BJ160:BJ165)","v":-2.7199637225627377E-3},8.0551600941701886E-5,-1.4985769539801032E-4,2.8112314608392391E-3,-2.5774425661101677E-5,1.2419972551037743E-6,{"$f":"SQRT(MMULT(BJ151:BO151,BR160:BR165))*1.96","v":1.0525843576526326},null,null,null,null,null,{"$f":"CONCATENATE(TEXT(T156,0),\" \",BQ154,\" \",TEXT(BP151,\"0.0\"))","v":"35 ± 1.1"}]
[151,92.755905511811022,60,2009,44,25,84,0,null,"Wallace and Hussain estimator of component variances",null,null,null,null,null,null,null,null,null,null,null,null,null,null,null,null,null,null,null,null,null,null,null,null,null,null,null,null,null,null,null,null,null,null,null,null,null,null,null,null,null,null,null,null,null,null,null,null,null,null,"Avg",{"$f":"MMULT($BJ$156:$BO$156,BJ160:BJ165)","v":2.0367083797093871E-2},-1.1083429299041901E-6,-1.3520350349061983E-4,9.1630816355742911E-4,-2.2693257958712179E-5,1.4769177593008635E-6,{"$f":"SQRT(MMULT(BJ152:BO152,BQ160:BQ165))*1.96","v":1.5020102777088344},"95% C.I. of profit maximizing rate at conditional mean",null,null,null,null,{"$f":"CONCATENATE(TEXT(U156,0),\" \",BQ154,\" \",TEXT(BP152,\"0.0\"))","v":"55 ± 1.5"}]
[152,100,120,2009,44,43,84,0,null,"White cross-section standard errors & covariance (d.f. corrected)",null,null,null,null,null,null,"What is your cost to apply fertilizer (equipment, labor, fuel or custom)?",null,null,null,14.999999999999993,{"$f":"IF(W142,CONCATENATE(\"$ ha\",Z155),\"$/acre\")","v":"$ ha⁻¹"},{"$f":"CONCATENATE(\"...your rate in \",IF(W142,CONCATENATE(\"kg K ha\",Z155),CONCATENATE(\"lbs of K\",Z153,\"O/acre\")),\":\")","v":"...your rate in kg K ha⁻¹:"},null,{"$f":"(237-1.61*U151)*0.9305091","v":51.243136136999993},"₂",null,null,null,null,null,null,null,null,null,null,null,null,null,null,null,null,null,null,null,null,null,null,null,null,null,null,null,null,null,null,null,null,null,null,"Low",{"$f":"MMULT($BJ$155:$BO$155,BJ160:BJ165)","v":5.5798886371972056E-2},{"$f":"MMULT($BJ$155:$BO$155,BK160:BK165)","v":-1.5104763176530074E-4},-4.4711131255543123E-5,-3.0817056554663103E-3,-7.9949743499011547E-6,1.2928753566758068E-6,{"$f":"SQRT(MMULT(BJ153:BO153,BP160:BP165))*1.96","v":1.8738220942293353},null,null,null,null,null,{"$f":"CONCATENATE(TEXT(V156,0),\" \",BQ154,\" \",TEXT(BP153,\"0.0\"))","v":"71 ± 1.9"}]
[153,66.21392190152801,0,2009,45,5,85,0,null,"Variable","Coefficient","Std. Error","t-Statistic","Prob.  ","English",null,{"$f":"CONCATENATE(\"Profit change comparing applying at \",TEXT(ROUND(U156,1),\"0.0\"),IF(W142,CONCATENATE(\" kg K ha\",Z155),CONCATENATE(\"lb K\",Z153,\"O/acre\")),\" to no fertilizer:\")","v":"Profit change comparing applying at 55.0 kg K ha⁻¹ to no fertilizer:"},null,null,null,{"$f":"+U160*$U$145/IF(W142,1,1)-U156*$W$147-IF(U156>0,$U$153)-R165*$U$145/IF(W142,1,1)","v":6.4385160550116325},{"$f":"IF(W142,CONCATENATE(\"$ ha\",Z155),\"$/acre\")","v":"$ ha⁻¹"},"...to your rate:",null,{"$f":"+U162","v":9.9055182242788753E-2},{"$f":"CONCATENATE(\"Fertilizer-K Application Rate (lbs K\",Z153,\"O/acre)\")","v":"Fertilizer-K Application Rate (lbs K₂O/acre)"},null,null,null,null,null,null,null,null,null,null,null,null,null,null,null,null,null,null,null,null,null,null,null,null,null,null,null,null,null,null,null,null,null,null,null,null,null,null,null,null,null,null,"±"]
[154,77.58913412563669,40,2009,45,14,99,0,null,null,null,null,null,null,null,null,null,null,null,{"$f":"CONCATENATE(U151+Y151,\" ppm soil K\")","v":"123 ppm soil K"},{"$f":"CONCATENATE(U151,\" ppm soil K\")","v":"113 ppm soil K"},{"$f":"CONCATENATE(U151-Y151,\" ppm soil K\")","v":"103 ppm soil K"},"K yield max",null,null,"⁻¹",null,null,null,null,null,null,null,null,null,null,null,null,null,null,null,null,null,null,null,null,null,null,null,null,null,null,null,null,null,null,null,null,null,null,"Low",{"$f":"+V156","v":70.83053816231714},{"$f":"+BJ155^2","v":5016.9651363634648},{"$f":"+(U151-Y151)*BJ155","v":7295.5454307186656},{"$f":"+(U151-Y151)^0.5*BJ155","v":718.851451306483},{"$f":"+(U151-Y151)^0.5*BK155","v":50916.635154800904},{"$f":"+(U151-Y151)*BK155","v":516747.40904543689}]
[155,83.361629881154514,80,2009,45,31,101,0,null,"C",13.0461057282188,8.2197659999999999,1.5871630000000001,0.1133,13.0461057284479,null,"Profit Maximizing K rate:",null,null,{"$f":"IF((IF(W142,K159,O159)+2*IF(W142,K160,O160)*0.1+IF(W142,K161,O161)*(U151+Y151)+IF(W142,K162,O162)*(U151+Y151)^0.5+2*IF(W142,K163,O163)*(U151+Y151)^0.5*0.1+2*IF(W142,K164,O164)*(U151+Y151)*0.1)<0,0,IF(((IF(W142,K159,O159)+2*IF(W142,K160,O160)*Y149+IF(W142,K161,O161)*(U151+Y151)+IF(W142,K162,O162)*(U151+Y151)^0.5+2*IF(W142,K163,O163)*(U151+Y151)^0.5*Y149+2*IF(W142,K164,O164)*(U151+Y151)*Y149)*U145/IF(W142,1,1)*W149)>W147,IF(Y149<T188,Y149,T188),IF((W147/(U145/IF(W142,1,1)*W149)-IF(W142,K159,O159)-IF(W142,K161,O161)*(U151+Y151)-IF(W142,K162,O162)*(U151+Y151)^0.5)/(2*(IF(W142,K160,O160)+IF(W142,K163,O163)*(U151+Y151)^0.5+IF(W142,K164,O164)*(U151+Y151)))<0,0,IF((W147/(U145/IF(W142,1,1)*W149)-IF(W142,K159,O159)-IF(W142,K161,O161)*(U151+Y151)-IF(W142,K162,O162)*(U151+Y151)^0.5)/(2*(IF(W142,K160,O160)+IF(W142,K163,O163)*(U151+Y151)^0.5+IF(W142,K164,O164)*(U151+Y151)))>T188,T188,(W147/(U145/IF(W142,1,1)*W149)-IF(W142,K159,O159)-IF(W142,K161,O161)*(U151+Y151)-IF(W142,K162,O162)*(U151+Y151)^0.5)/(2*(IF(W142,K160,O160)+IF(W142,K163,O163)*(U151+Y151)^0.5+IF(W142,K164,O164)*(U151+Y151)))))))","v":35.294251017595791},{"$f":"IF((IF(W142,K159,O159)+2*IF(W142,K160,O160)*0.1+IF(W142,K161,O161)*(U151)+IF(W142,K162,O162)*(U151)^0.5+2*IF(W142,K163,O163)*(U151)^0.5*0.1+2*IF(W142,K164,O164)*(U151)*0.1)<0,0,IF(((IF(W142,K159,O159)+2*IF(W142,K160,O160)*Y149+IF(W142,K161,O161)*(U151)+IF(W142,K162,O162)*(U151)^0.5+2*IF(W142,K163,O163)*(U151)^0.5*Y149+2*IF(W142,K164,O164)*(U151)*Y149)*U145/IF(W142,1,1)*W149)>W147,IF(Y149<U188,Y149,U188),IF((W147/(U145/IF(W142,1,1)*W149)-IF(W142,K159,O159)-IF(W142,K161,O161)*(U151)-IF(W142,K162,O162)*(U151)^0.5)/(2*(IF(W142,K160,O160)+IF(W142,K163,O163)*(U151)^0.5+IF(W142,K164,O164)*(U151)))<0,0,IF((W147/(U145/IF(W142,1,1)*W149)-IF(W142,K159,O159)-IF(W142,K161,O161)*(U151)-IF(W142,K162,O162)*(U151)^0.5)/(2*(IF(W142,K160,O160)+IF(W142,K163,O163)*(U151)^0.5+IF(W142,K164,O164)*(U151)))>U188,U188,(W147/(U145/IF(W142,1,1)*W149)-IF(W142,K159,O159)-IF(W142,K161,O161)*(U151)-IF(W142,K162,O162)*(U151)^0.5)/(2*(IF(W142,K160,O160)+IF(W142,K163,O163)*(U151)^0.5+IF(W142,K164,O164)*(U151)))))))","v":54.980357287474348},{"$f":"IF((IF(W142,K159,O159)+2*IF(W142,K160,O160)*0.1+IF(W142,K161,O161)*(U151-Y151)+IF(W142,K162,O162)*(U151-Y151)^0.5+2*IF(W142,K163,O163)*(U151-Y151)^0.5*0.1+2*IF(W142,K164,O164)*(U151-Y151)*0.1)<0,0,IF(((IF(W142,K159,O159)+2*IF(W142,K160,O160)*Y149+IF(W142,K161,O161)*(U151-Y151)+IF(W142,K162,O162)*(U151-Y151)^0.5+2*IF(W142,K163,O163)*(U151-Y151)^0.5*Y149+2*IF(W142,K164,O164)*(U151-Y151)*Y149)*U145/IF(W142,1,1)*W149)>W147,IF(Y149<V188,Y149,V188),IF((W147/(U145/IF(W142,1,1)*W149)-IF(W142,K159,O159)-IF(W142,K161,O161)*(U151-Y151)-IF(W142,K162,O162)*(U151-Y151)^0.5)/(2*(IF(W142,K160,O160)+IF(W142,K163,O163)*(U151-Y151)^0.5+IF(W142,K164,O164)*(U151-Y151)))<0,0,IF((W147/(U145/IF(W142,1,1)*W149)-IF(W142,K159,O159)-IF(W142,K161,O161)*(U151-Y151)-IF(W142,K162,O162)*(U151-Y151)^0.5)/(2*(IF(W142,K160,O160)+IF(W142,K163,O163)*(U151-Y151)^0.5+IF(W142,K164,O164)*(U151-Y151)))>V188,V188,(W147/(U145/IF(W142,1,1)*W149)-IF(W142,K159,O159)-IF(W142,K161,O161)*(U151-Y151)-IF(W142,K162,O162)*(U151-Y151)^0.5)/(2*(IF(W142,K160,O160)+IF(W142,K163,O163)*(U151-Y151)^0.5+IF(W142,K164,O164)*(U151-Y151)))))))","v":70.83053816231714},{"$f":"+U187","v":127.52942009126573},null,null,{"$f":"CONCATENATE(\"Soybean Grain Yield (kg ha\",Z155,\")\")","v":"Soybean Grain Yield (kg ha⁻¹)"},null,null,null,null,null,null,null,null,null,null,null,null,null,null,null,null,null,null,null,null,null,null,null,null,null,null,null,null,null,null,null,null,null,null,"Avg",{"$f":"+U156","v":54.980357287474348},{"$f":"+BJ156^2","v":3022.8396874583336},{"$f":"+U151*BJ156","v":6212.7803734846011},{"$f":"U151^0.5*BJ156","v":584.44921480210041},{"$f":"+U151^0.5*BK156","v":32133.226646203322},{"$f":"U151*BK156","v":341580.88468279172}]
[156,96.264855687606115,120,2009,45,44,105,0,null,"KSOIL",-0.36997842219628302,4.5536E-2,-8.124924,0,-0.36997842219448002,null,"VMP @ Profit Max:",null,null,91.955804141933456,91.955804141933456,91.955804141933456,null,null,null,{"$f":"CONCATENATE(\"Fertilizer-K Application Rate (kg K ha\",Z155,\")\")","v":"Fertilizer-K Application Rate (kg K ha⁻¹)"},null,null,null,null,null,null,null,null,null,null,null,null,null,null,null,null,null,null,null,null,null,null,null,null,null,null,null,null,null,null,null,null,null,null,"High",{"$f":"+T156","v":35.294251017595791},{"$f":"+BJ157^2","v":1245.6841548930615},{"$f":"+(U151+Y151)*BJ157","v":4341.1928751642827},{"$f":"+(U151+Y151)^0.5*BJ157","v":391.43217937702383},{"$f":"+(U151+Y151)^0.5*BK157","v":13815.305595297263},{"$f":"(U151+Y151)*BK157","v":153219.15105184657}]
[157,100,160,2009,45,52,123,0,null,"KSOIL^.5",11.258558845204201,1.2219370000000001,9.2136960000000006,0,11.258558845162501,null,"UAEX recommendation:",null,null,{"$f":"237-1.61*(U151+Y151)","v":38.97},{"$f":"+Y153","v":51.243136136999993},{"$f":"237-1.61*(U151-Y151)","v":71.169999999999987},null,null,null,null,null,null,null,null,null,null,null,null,null,null,null,null,null,null,null,null,null,null,null,null,null,null,null,null,null,null,null,null,null,null,null,null,null,null,null,"Coefficient Covariance Matrix as available in Eviews under the View Menu in the Equation Editor"]
[158,76.823338735818467,0,2009,46,6,81,0,null,"MKRATE",1.2607734913644499,0.186145,6.7730629999999996,0,1.17316119421223,null,null,null,null,{"$f":"+T156-T158","v":-3.6757489824042082},{"$f":"+U156-U158","v":3.7372211504743547},{"$f":"+V156-V158","v":-0.33946183768284754},"Est. Yield Max",null,null,null,null,null,null,null,null,null,null,null,null,null,null,null,null,null,null,null,null,null,null,null,null,null,null,null,null,null,null,null,null,null,null,null,null,null,null,"K","K^2","S*K","S^.5*K","S^.5*K^2","S*K^2","Low","Avg","High",null,null,null,null,"English"]
[159,86.547811993517016,40,2009,46,15,94,0,null,"MKRATE^2",-4.2700667458811696E-3,8.8900000000000003E-4,-4.8009779999999997,0,-3.6972251934216799E-3,null,"Est. Yield at Profit-Max K:",null,null,{"$f":"IF((+K156+K157*(U151+Y151)+K158*(U151+Y151)^0.5+IF(W142,K159,O159)*T156+IF(W142,K160,O160)*T156^2+IF(W142,K161,O161)*(U151+Y151)*T156+IF(W142,K162,O162)*(U151+Y151)^0.5*T156+IF(W142,K163,O163)*(U151+Y151)^0.5*T156^2+IF(W142,K164,O164)*(U151+Y151)*T156^2)*W149>U149,U149,(+K156+K157*(U151+Y151)+K158*(U151+Y151)^0.5+IF(W142,K159,O159)*T156+IF(W142,K160,O160)*T156^2+IF(W142,K161,O161)*(U151+Y151)*T156+IF(W142,K162,O162)*(U151+Y151)^0.5*T156+IF(W142,K163,O163)*(U151+Y151)^0.5*T156^2+IF(W142,K164,O164)*(U151+Y151)*T156^2)*W149)","v":4007.7595336492582},{"$f":"IF((+K156+K157*U151+K158*U151^0.5+IF(W142,K159,O159)*U156+IF(W142,K160,O160)*U156^2+IF(W142,K161,O161)*U151*U156+IF(W142,K162,O162)*U151^0.5*U156+IF(W142,K163,O163)*U151^0.5*U156^2+IF(W142,K164,O164)*(U151)*U156^2)*W149>U149,U149,(+K156+K157*U151+K158*U151^0.5+IF(W142,K159,O159)*U156+IF(W142,K160,O160)*U156^2+IF(W142,K161,O161)*U151*U156+IF(W142,K162,O162)*U151^0.5*U156+IF(W142,K163,O163)*U151^0.5*U156^2+IF(W142,K164,O164)*(U151)*U156^2)*W149)","v":4031.1945311879572},{"$f":"IF((+K156+K157*(U151-Y151)+K158*(U151-Y151)^0.5+IF(W142,K159,O159)*V156+IF(W142,K160,O160)*V156^2+IF(W142,K161,O161)*(U151-Y151)*V156+IF(W142,K162,O162)*(U151-Y151)^0.5*V156+IF(W142,K163,O163)*(U151-Y151)^0.5*V156^2+IF(W142,K164,O164)*(U151-Y151)*V156^2)*W149>U149,U149,(+K156+K157*(U151-Y151)+K158*(U151-Y151)^0.5+IF(W142,K159,O159)*V156+IF(W142,K160,O160)*V156^2+IF(W142,K161,O161)*(U151-Y151)*V156+IF(W142,K162,O162)*(U151-Y151)^0.5*V156+IF(W142,K163,O163)*(U151-Y151)^0.5*V156^2+IF(W142,K164,O164)*(U151-Y151)*V156^2)*W149)","v":4052.5083626266737},{"$f":"IF((+K156+K157*U151+K158*U151^0.5+IF(W142,K159,O159)*W156+IF(W142,K160,O160)*W156^2+IF(W142,K161,O161)*U151*W156+IF(W142,K162,O162)*U151^0.5*W156+IF(W142,K163,O163)*U151^0.5*W156^2+IF(W142,K164,O164)*(U151)*W156^2)*W149>U149,U149,(+K156+K157*U151+K158*U151^0.5+IF(W142,K159,O159)*W156+IF(W142,K160,O160)*W156^2+IF(W142,K161,O161)*U151*W156+IF(W142,K162,O162)*U151^0.5*W156+IF(W142,K163,O163)*U151^0.5*W156^2+IF(W142,K164,O164)*(U151)*W156^2)*W149)","v":4124.657155338241},null,null,null,null,null,null,null,null,null,null,null,null,null,null,null,null,null,null,null,null,null,null,null,null,null,null,null,null,null,null,null,null,null,null,null,null,null,"KRATE",{"$f":"IF($W$142,BU167,BU160)","v":3.4650049802922397E-2},{"$f":"IF($W$142,BV167,BV160)","v":-1.6087975248549899E-4},1.69004363344823E-4,-5.0065883129660803E-3,2.2541909231094101E-5,-7.2201345674309696E-7,{"$f":"+BJ155","v":70.83053816231714},{"$f":"+BJ156","v":54.980357287474348},{"$f":"+BJ157","v":35.294251017595791},null,null,3.0001647446746001E-2,-1.2961738327255901E-4,1.46331949156338E-4,-4.3349403054506203E-3,1.8161535204648101E-5,-5.8171083373476603E-7]
[160,94.813614262560776,80,2009,46,32,98,0,null,"KSOIL*MKRATE",5.55251161954753E-3,1.0579999999999999E-3,5.2478490000000004,0,5.1666625346217703E-3,null,"Est. Yield at UAEX rec.:",null,null,{"$f":"IF((+K156+K157*(U151+Y151)+K158*(U151+Y151)^0.5+IF(W142,K159,O159)*T158+IF(W142,K160,O160)*T158^2+IF(W142,K161,O161)*(U151+Y151)*T158+IF(W142,K162,O162)*(U151+Y151)^0.5*T158+IF(W142,K163,O163)*(U151+Y151)^0.5*T158^2+IF(W142,K164,O164)*(U151+Y151)*T158^2)*W149>U149,U149,(+K156+K157*(U151+Y151)+K158*(U151+Y151)^0.5+IF(W142,K159,O159)*T158+IF(W142,K160,O160)*T158^2+IF(W142,K161,O161)*(U151+Y151)*T158+IF(W142,K162,O162)*(U151+Y151)^0.5*T158+IF(W142,K163,O163)*(U151+Y151)^0.5*T158^2+IF(W142,K164,O164)*(U151+Y151)*T158^2)*W149)","v":4017.0309511821988},{"$f":"IF((+K156+K157*U151+K158*U151^0.5+IF(W142,K159,O159)*U158+IF(W142,K160,O160)*U158^2+IF(W142,K161,O161)*U151*U158+IF(W142,K162,O162)*U151^0.5*U158+IF(W142,K163,O163)*U151^0.5*U158^2+IF(W142,K164,O164)*(U151)*U158^2)*W149>U149,U149,(+K156+K157*U151+K158*U151^0.5+IF(W142,K159,O159)*U158+IF(W142,K160,O160)*U158^2+IF(W142,K161,O161)*U151*U158+IF(W142,K162,O162)*U151^0.5*U158+IF(W142,K163,O163)*U151^0.5*U158^2+IF(W142,K164,O164)*(U151)*U158^2)*W149)","v":4021.3174360019511},{"$f":"IF((+K156+K157*(U151-Y151)+K158*(U151-Y151)^0.5+IF(W142,K159,O159)*V158+IF(W142,K160,O160)*V158^2+IF(W142,K161,O161)*(U151-Y151)*V158+IF(W142,K162,O162)*(U151-Y151)^0.5*V158+IF(W142,K163,O163)*(U151-Y151)^0.5*V158^2+IF(W142,K164,O164)*(U151-Y151)*V158^2)*W149>U149,U149,(+K156+K157*(U151-Y151)+K158*(U151-Y151)^0.5+IF(W142,K159,O159)*V158+IF(W142,K160,O160)*V158^2+IF(W142,K161,O161)*(U151-Y151)*V158+IF(W142,K162,O162)*(U151-Y151)^0.5*V158+IF(W142,K163,O163)*(U151-Y151)^0.5*V158^2+IF(W142,K164,O164)*(U151-Y151)*V158^2)*W149)","v":4053.3805484408035},null,null,null,null,null,null,null,null,null,null,null,null,null,null,null,null,null,null,null,null,null,null,null,null,null,null,null,null,null,null,null,null,null,null,null,null,null,null,"KRATE^2",{"$f":"IF($W$142,BU168,BU161)","v":-1.6087975248549899E-4},7.9106091984856803E-7,-8.2786571923131601E-7,2.3948025585672902E-5,-1.1664465492862901E-7,3.9462977068615203E-9,{"$f":"+BK155","v":5016.9651363634648},{"$f":"+BK156","v":3022.8396874583336},{"$f":"+BK157","v":1245.6841548930615},null,null,-1.2961738327255901E-4,5.93051502063369E-7,-6.6699374264808004E-7,1.9294413143833301E-5,-8.7447484860609705E-8,2.9585051212485999E-9]
[161,96.758508914100489,120,2009,46,45,105,0,null,"KSOIL^.5*MKRATE",-0.16752888941568,2.7782999999999999E-2,-6.0300019999999996,0,-0.15588715444786799,null,"Added Profit in $/acre",null,null,{"$f":"+(T160-T161)*U145/IF(W142,1,1)-(T156-T158)*W147-IF(T158=0,IF(T156=0,0,U153),IF(T156=0,IF(T158>0,-U153,0)))","v":7.9592252961705245E-2},{"$f":"+(U160-U161)*U145/IF(W142,1,1)-(U156-U158)*W147-IF(U158=0,IF(U156=0,0,U153),IF(U156=0,IF(U158>0,-U153,0)))","v":9.9055182242788753E-2},{"$f":"+(V160-V161)*U145/IF(W142,1,1)-(V156-V158)*W147-IF(V158=0,IF(V156=0,0,U153),IF(V156=0,IF(V158>0,-U153,0)))","v":9.7841183910729601E-4},{"$f":"+(U160-W160)*U145/IF(W142,1,1)-(U156-W156)*W147-IF(W156=0,IF(U156=0,0,U153),IF(U156=0,IF(W156>0,-U153,0)))","v":37.32873032457362},null,null,null,null,null,null,null,null,null,null,null,null,null,null,null,null,null,null,null,null,null,null,null,null,null,null,null,null,null,null,null,null,null,null,null,null,null,"KSOIL*KRATE",{"$f":"IF($W$142,BU169,BU162)","v":1.69004363344823E-4},-8.2786571923131601E-7,1.1194799189843999E-6,-2.8112972933305201E-5,1.3916421034931899E-7,-5.6235332310365004E-9,{"$f":"+BL155","v":7295.5454307186656},{"$f":"+BL156","v":6212.7803734846011},{"$f":"+BL157","v":4341.1928751642827},null,null,1.46331949156338E-4,-6.6699374264808004E-7,9.69298515985454E-7,-2.4341537960752401E-5,1.12121634398733E-7,-4.5307607133429097E-9]
[162,100,160,2009,46,53,115,0,null,"KSOIL^.5*MKRATE^2",5.60746335383506E-4,1.3899999999999999E-4,4.0453549999999998,1E-4,4.85520625714851E-4,null,"Yield change:",null,null,{"$f":"+T161-T160","v":9.2714175329406316},{"$f":"+U161-U160","v":-9.877095186006045},{"$f":"+V161-V160","v":0.87218581412980711},{"$f":"+W160-U160","v":93.462624150283773},null,null,null,null,null,null,null,null,null,null,null,null,null,null,null,null,null,null,null,null,null,null,null,null,null,null,null,null,null,null,null,null,null,null,null,null,null,"KSOIL^0.5*KRATE",{"$f":"IF($W$142,BU170,BU163)","v":-5.0065883129660803E-3},2.3948025585672902E-5,-2.8112972933305201E-5,7.7187054032625099E-4,-3.6585277002670499E-6,1.31418874064512E-7,{"$f":"+BM155","v":718.851451306483},{"$f":"+BM156","v":584.44921480210041},{"$f":"+BM157","v":391.43217937702383},null,null,-4.3349403054506203E-3,1.9294413143833301E-5,-2.4341537960752401E-5,6.6832192037352797E-4,-2.94759769210557E-6,1.0588138224573701E-7]
[163,78.633975481611202,0,2010,47,1,73,0,null,"KSOIL*MKRATE^2",-1.8687034552369899E-5,5.7300000000000002E-6,-3.2638280000000002,1.1999999999999999E-3,-1.61801159207601E-5,null,"K rate",{"$f":"CONCATENATE(\"Est. Yield (STK = \",U151,\")\")","v":"Est. Yield (STK = 113)"},{"$f":"CONCATENATE(\"Est. Yield (STK = \",U151-Y151,\")\")","v":"Est. Yield (STK = 103)"},{"$f":"CONCATENATE(\"Est. Yield (STK = \",U151+Y151,\")\")","v":"Est. Yield (STK = 123)"},null,null,null,null,null,null,"Year","Potash Fertilizer Price in $/ton","Soybean Price in $/bu","Soybean Yield in bu/acre","$/kg Ps","$/Mg K","Y in kg/ha",null,"$/kg K",null,null,null,null,null,null,null,null,null,null,null,null,null,null,null,null,null,null,null,null,null,null,null,null,null,"KSOIL0.5*KRATE^2",{"$f":"IF($W$142,BU171,BU164)","v":2.2541909231094101E-5},-1.1664465492862901E-7,1.3916421034931899E-7,-3.6585277002670499E-6,1.9214082698905101E-8,-7.4137900477903896E-10,{"$f":"+BN155","v":50916.635154800904},{"$f":"+BN156","v":32133.226646203322},{"$f":"+BN157","v":13815.305595297263},null,null,1.8161535204648101E-5,-8.7447484860609705E-8,1.12121634398733E-7,-2.94759769210557E-6,1.44046309446369E-8,-5.55805401754784E-10]
[164,95.796847635726806,45,2010,47,22,73,0,null,null,null,null,null,null,null,null,0,{"$f":"IF((+$K$156+$K$157*$U$151+$K$158*$U$151^0.5+$K$159*Q165+$K$160*Q165^2+$K$161*$U$151*Q165+$K$162*$U$151^0.5*Q165+$K$163*$U$151^0.5*Q165^2+$K$164*$U$151*Q165^2)*$W$149>$U$149,$U$149,(+$K$156+$K$157*$U$151+$K$158*$U$151^0.5+$K$159*Q165+$K$160*Q165^2+$K$161*$U$151*Q165+$K$162*$U$151^0.5*Q165+$K$163*$U$151^0.5*Q165^2+$K$164*$U$151*Q165^2)*$W$149)","v":3835.8585263794466},{"$f":"IF((+$K$156+$K$157*($U$151-$Y$151)+$K$158*($U$151-$Y$151)^0.5+$K$159*Q165+$K$160*Q165^2+$K$161*($U$151-$Y$151)*Q165+$K$162*($U$151-$Y$151)^0.5*Q165+$K$163*($U$151-$Y$151)^0.5*Q165^2+$K$164*($U$151-$Y$151)*Q165^2)*$W$149>$U$149,$U$149,(+$K$156+$K$157*($U$151-$Y$151)+$K$158*($U$151-$Y$151)^0.5+$K$159*Q165+$K$160*Q165^2+$K$161*($U$151-$Y$151)*Q165+$K$162*($U$151-$Y$151)^0.5*Q165+$K$163*($U$151-$Y$151)^0.5*Q165^2+$K$164*($U$151-$Y$151)*Q165^2)*$W$149)","v":3763.3573299467616},{"$f":"IF((+$K$156+$K$157*($U$151+$Y$151)+$K$158*($U$151+$Y$151)^0.5+$K$159*Q165+$K$160*Q165^2+$K$161*($U$151+$Y$151)*Q165+$K$162*($U$151+$Y$151)^0.5*Q165+$K$163*($U$151+$Y$151)^0.5*Q165^2+$K$164*($U$151+$Y$151)*Q165^2)*$W$149>$U$149,$U$149,(+$K$156+$K$157*($U$151+$Y$151)+$K$158*($U$151+$Y$151)^0.5+$K$159*Q165+$K$160*Q165^2+$K$161*($U$151+$Y$151)*Q165+$K$162*($U$151+$Y$151)^0.5*Q165+$K$163*($U$151+$Y$151)^0.5*Q165^2+$K$164*($U$151+$Y$151)*Q165^2)*$W$149)","v":3898.4495639348875},{"$f":"ROUNDUP((MAX(BJ175:BJ548,U149)+IF(W142,500,10))/10,0)*10","v":4720},null,null,null,null,null,2009,{"$f":"26.1*20","v":522},9.66,39,{"$f":"+AC165/60*2204.62/1000","v":0.35494382000000002},{"$f":"+AB165/2000*2204","v":575.24400000000003},{"$f":"+(AD165*60*0.4536)*2.4711","v":2622.8848463999998},null,{"$f":"+AF165/1000/0.49809078131038","v":1.1548979053309216},null,null,null,null,null,null,null,null,{"$f":"CONCATENATE(\"Obs. Yields (\",U151-Y151,\" < STK < \",U151+Y151,\")\")","v":"Obs. Yields (103 < STK < 123)"},null,null,null,null,null,null,null,null,null,null,null,null,null,null,null,null,"KSOIL*KRATE^2",{"$f":"IF($W$142,BU172,BU165)","v":-7.2201345674309696E-7},3.9462977068615203E-9,-5.6235332310365004E-9,1.31418874064512E-7,-7.4137900477903896E-10,3.2781310296434799E-11,{"$f":"+BO155","v":516747.40904543689},{"$f":"+BO156","v":341580.88468279172},{"$f":"+BO157","v":153219.15105184657},null,null,-5.8171083373476603E-7,2.9585051212485999E-9,-4.5307607133429097E-9,1.0588138224573701E-7,-5.55805401754784E-10,2.4575863656483799E-11]
[165,100,90,2010,47,39,73,0,null,null,"Effects Specification",null,null,null,null,null,2,{"$f":"IF((+$K$156+$K$157*$U$151+$K$158*$U$151^0.5+$K$159*Q166+$K$160*Q166^2+$K$161*$U$151*Q166+$K$162*$U$151^0.5*Q166+$K$163*$U$151^0.5*Q166^2+$K$164*$U$151*Q166^2)*$W$149>$U$149,$U$149,(+$K$156+$K$157*$U$151+$K$158*$U$151^0.5+$K$159*Q166+$K$160*Q166^2+$K$161*$U$151*Q166+$K$162*$U$151^0.5*Q166+$K$163*$U$151^0.5*Q166^2+$K$164*$U$151*Q166^2)*$W$149)","v":3844.8457565889667},{"$f":"IF((+$K$156+$K$157*($U$151-$Y$151)+$K$158*($U$151-$Y$151)^0.5+$K$159*Q166+$K$160*Q166^2+$K$161*($U$151-$Y$151)*Q166+$K$162*($U$151-$Y$151)^0.5*Q166+$K$163*($U$151-$Y$151)^0.5*Q166^2+$K$164*($U$151-$Y$151)*Q166^2)*$W$149>$U$149,$U$149,(+$K$156+$K$157*($U$151-$Y$151)+$K$158*($U$151-$Y$151)^0.5+$K$159*Q166+$K$160*Q166^2+$K$161*($U$151-$Y$151)*Q166+$K$162*($U$151-$Y$151)^0.5*Q166+$K$163*($U$151-$Y$151)^0.5*Q166^2+$K$164*($U$151-$Y$151)*Q166^2)*$W$149)","v":3774.448397500395},{"$f":"IF((+$K$156+$K$157*($U$151+$Y$151)+$K$158*($U$151+$Y$151)^0.5+$K$159*Q166+$K$160*Q166^2+$K$161*($U$151+$Y$151)*Q166+$K$162*($U$151+$Y$151)^0.5*Q166+$K$163*($U$151+$Y$151)^0.5*Q166^2+$K$164*($U$151+$Y$151)*Q166^2)*$W$149>$U$149,$U$149,(+$K$156+$K$157*($U$151+$Y$151)+$K$158*($U$151+$Y$151)^0.5+$K$159*Q166+$K$160*Q166^2+$K$161*($U$151+$Y$151)*Q166+$K$162*($U$151+$Y$151)^0.5*Q166+$K$163*($U$151+$Y$151)^0.5*Q166^2+$K$164*($U$151+$Y$151)*Q166^2)*$W$149)","v":3905.6259114781988},{"$f":"ROUNDDOWN((S165-IF(W142,500,10))/10,0)*10","v":3260},null,null,null,null,null,2010,{"$f":"23*20","v":460},10.9,39.5,{"$f":"+AC166/60*2204.62/1000","v":0.40050596666666666},{"$f":"+AB166/2000*2204","v":506.92},{"$f":"+(AD166*60*0.4536)*2.4711","v":2656.5115751999997},null,{"$f":"+AF166/1000/0.49809078131038","v":1.0177261234716934},null,null,null,null,null,null,null,null,{"$f":"CONCATENATE(\"Estimated Yield Response to K Fertilizer and Profit-Maximizing Application Rates for a Range of Initial Soil-Test K Values (STK) at Specified Yield Potential\")","v":"Estimated Yield Response to K Fertilizer and Profit-Maximizing Application Rates for a Range of Initial Soil-Test K Values (STK) at Specified Yield Potential"},null,null,null,null,null,null,null,null,null,null,null,null,null,null,null,null,null,null,null,null,null,null,null,null,null,null,null,null,null,null,"Metric"]
[166,92.925430210325061,0,2010,49,2,73,0,null,null,null,null,"S.D.  ","Rho  ",null,null,5,3858.0602439822069,3790.7661199224126,3916.169192045209,null,null,null,null,null,null,2011,{"$f":"29.19*20","v":583.80000000000007},12.3,42.2,0.45194710000000005,643.34760000000006,2838.0959107200001,null,1.2916271975712492,null,null,null,null,null,null,null,null,null,null,null,null,null,null,null,null,null,null,null,null,null,null,null,null,null,null,null,null,null,null,null,null,null,null,null,null,null,3.4650049802922397E-2,-1.6087975248549899E-4,1.69004363344823E-4,-5.0065883129660803E-3,2.2541909231094101E-5,-7.2201345674309696E-7]
[167,98.470363288718929,40,2010,49,14,109,0,null,null,null,null,null,null,null,null,7,3866.692330297009,3801.4320155981368,3923.0505519245798,null,null,null,null,null,null,2012,{"$f":"29.8*20","v":596},14.3,48.3,0.52543443333333339,656.79199999999992,3248.3420020799995,null,1.318619064324194,null,null,null,null,null,null,null,null,null,null,null,null,null,null,null,null,null,null,null,null,null,null,null,null,null,null,null,null,null,null,null,null,null,null,null,null,null,-1.6087975248549899E-4,7.9106091984856803E-7,-8.2786571923131601E-7,2.3948025585672902E-5,-1.1664465492862901E-7,3.9462977068615203E-9]
[168,100,80,2010,49,31,115,0,null,"Period random",null,null,1.1437949999999999,5.4899999999999997E-2,null,null,10,3879.3741018481724,3817.1119802032913,3933.1513509956799,null,null,null,null,null,null,2013,{"$f":"23.75*20","v":475},13.1,46.4,0.48134203333333331,523.44999999999993,3120.5604326399998,null,1.0509128448892486,null,null,null,null,null,null,null,null,null,null,null,null,null,null,null,null,null,null,null,null,null,null,null,null,null,null,null,null,null,null,null,null,null,null,null,null,null,1.69004363344823E-4,-8.2786571923131601E-7,1.1194799189843999E-6,-2.8112972933305201E-5,1.3916421034931899E-7,-5.6235332310365004E-9]
[169,93.307839388145325,120,2010,49,41,142,0,null,"Idiosyncratic random",null,null,4.7465539999999997,0.94510000000000005,null,null,15,3899.800099977344,3842.3949107893959,3949.3960407862955,null,null,null,null,null,null,2014,{"$f":"23.6*20","v":472},10.6,51.9,0.38948286666666665,520.14400000000001,3490.4544494400002,null,1.0442755006057376,null,null,null,null,null,null,null,null,null,null,null,null,null,null,null,null,null,null,null,null,null,null,null,null,null,null,null,null,null,null,null,null,null,null,null,null,null,-5.0065883129660803E-3,2.3948025585672902E-5,-2.8112972933305201E-5,7.7187054032625099E-4,-3.6585277002670499E-6,1.31418874064512E-7]
[170,96.940726577437871,160,2010,49,52,151,0,null,null,null,null,null,null,null,null,30,3955.7509359440901,3911.8661243790652,3993.7052951990281,null,null,null,null,null,null,2015,{"$f":"21.27*20","v":425.4},9.4600000000000009,51.4,0.34759508666666666,468.79079999999999,3456.8277206399998,null,0.941175419401866,null,null,null,null,null,null,null,null,null,null,null,null,null,null,null,null,null,null,null,null,null,null,null,null,null,null,null,null,null,null,null,null,null,null,null,null,null,2.2541909231094101E-5,-1.1664465492862901E-7,1.3916421034931899E-7,-3.6585277002670499E-6,1.9214082698905101E-8,-7.4137900477903896E-10]
[171,74.324324324324323,0,2011,51,1,167,0,null,null,"Weighted Statistics",null,null,null,null,null,45,4003.7110342796859,3971.7709707157705,4031.3773271730852,null,null,null,null,null,null,2016,{"$f":"16.97*20","v":339.4},9.83,50,0.36119024333333327,374.0188,3362.6728799999996,null,0.75090488327454941,null,null,null,null,null,null,null,null,null,null,null,null,null,null,null,null,null,null,null,null,null,null,null,null,null,null,null,null,null,null,null,null,0.93050909005023585,"convert lbs of K20/acre to kg K ha-1",null,null,null,-7.2201345674309696E-7,3.9462977068615203E-9,-5.6235332310365004E-9,1.31418874064512E-7,-7.4137900477903896E-10,3.2781310296434799E-11]
[172,91.891891891891902,40,2011,51,14,57,0,null,null,null,null,null,null,null,null,60,4043.6803949841305,4022.109449799515,4062.4121367084676,null,null,null,null,null,null,2017,{"$f":"18.98*20","v":379.6},9.77,52.9,0.35898562333333328,418.31920000000008,3557.70790704,null,0.83984529667359753,null,null,null,null,null,null,null,null,null,null,null,null,null,null,null,null,null,null,null,null,null,null,null,null,null,null,"Actual RelYld Obs Converted to Yield",null,null,null,"Min Yield"]
[173,95.945945945945937,80,2011,51,31,63,0,null,"R-squared",0.61152799999999996,"    Mean dependent var",null,60.152850000000001,null,null,75,4075.6590180574258,4062.8815616302959,4086.8097238051737,null,null,null,null,null,null,2018,{"$f":"20*20","v":400},8.81,53.2,0.32371170333333332,440.8,3577.88394432,null,0.88497923780147258,null,null,null,null,null,null,null,null,null,null,null,null,null,null,null,null,null,null,null,null,null,null,null,null,null,"RelYld","Yield","Krate","Ksoil",null,{"$f":"MIN(BN175:BN548)","v":999},null,"Mkrate"]
[174,98.648648648648646,120,2011,51,41,72,0,null,"Adjusted R-squared",0.60301300000000002,"    S.D. dependent var",null,8.6079609999999995,null,null,90,4099.6469034995698,4094.08730620811,4104.570088463207,null,null,null,null,null,null,"Avg.",{"$f":"AVERAGE($AB$165:$AB$174)","v":465.32000000000005},{"$f":"AVERAGE($AC$165:$AC$174)","v":10.872999999999999},{"$f":"AVERAGE($AD$165:$AD$174)","v":47.48},{"$f":"+AC175/60*2204.62/1000","v":0.39951388766666662},512.78264000000013,{"$f":"+(AD175*60*0.4536)*2.4711","v":3193.1941668479994},null,1.0294963473344534,null,null,null,null,null,null,null,null,null,null,null,null,null,null,null,null,null,null,null,null,null,null,null,null,null,{"$f":"_xlfn.NUMBERVALUE(IF(AND($G2>=($U$151-$Y$151),$G2<=($U$151+$Y$151)),B2,\"\"))","v":0},{"$f":"_xlfn.NUMBERVALUE(IFERROR(+BI175*$W$149,\"\"))","v":0},{"$f":"_xlfn.NUMBERVALUE(IF(AND($G2>=($U$151-$Y$151),$G2<=($U$151+$Y$151)),C2,\"\"))","v":0},{"$f":"_xlfn.NUMBERVALUE(IF(AND($G2>=($U$151-$Y$151),$G2<=($U$151+$Y$151)),G2,\"\"))","v":0},null,{"$f":"IF(BJ175=0,999,BJ175)","v":999},null,{"$f":"+BK175*$BP$172","v":0}]
[175,100,160,2011,51,52,83,0,null,"S.E. of regression",4.7459629999999997,"    Sum squared resid",null,8221.32,null,null,105,4115.6440513105654,4115.7266835329629,4115.6932306825638,null,null,null,null,null,null,"Min.",{"$f":"MIN($AB$165:$AB$174)","v":339.4},{"$f":"MIN($AC$165:$AC$174)","v":8.81},{"$f":"MIN($AD$165:$AD$174)","v":39},null,null,null,null,null,null,null,null,null,null,null,null,null,null,null,null,null,null,null,null,null,null,null,null,null,null,null,null,null,null,{"$f":"_xlfn.NUMBERVALUE(IF(AND($G3>=($U$151-$Y$151),$G3<=($U$151+$Y$151)),B3,\"\"))","v":0},{"$f":"_xlfn.NUMBERVALUE(IFERROR(+BI176*$W$149,\"\"))","v":0},{"$f":"_xlfn.NUMBERVALUE(IF(AND($G3>=($U$151-$Y$151),$G3<=($U$151+$Y$151)),C3,\"\"))","v":0},{"$f":"_xlfn.NUMBERVALUE(IF(AND($G3>=($U$151-$Y$151),$G3<=($U$151+$Y$151)),G3,\"\"))","v":0},null,{"$f":"IF(BJ176=0,999,BJ176)","v":999},null,{"$f":"+BK176*$BP$172","v":0}]
[176,89.65517241379311,0,2011,53,2,89,0,null,"F-statistic",71.82226,"    Durbin-Watson stat",null,1.923694,null,null,120,4123.6504614904061,4127.7996936048539,4120.1791504632429,null,null,null,null,null,null,"Max.",{"$f":"MAX($AB$165:$AB$174)","v":596},{"$f":"MAX($AC$165:$AC$174)","v":14.3},{"$f":"MAX($AD$165:$AD$174)","v":53.2},null,null,null,null,null,null,null,null,null,null,null,null,null,null,null,null,null,null,null,null,null,null,null,null,null,null,null,null,null,null,0,0,0,0,null,999,null,0]
[177,98.275862068965509,40,2011,53,15,113,0,null,"Prob(F-statistic)",0,null,null,null,null,null,135,4123.6661340390983,4130.3063364237796,4118.0278478052514,null,null,null,null,null,null,null,null,null,null,null,null,null,null,null,null,null,null,null,null,null,null,null,null,null,null,null,null,null,null,null,null,null,null,null,null,null,null,null,null,0,0,0,0,null,999,null,0]
[178,100,80,2011,53,32,120,0,null,null,null,null,null,null,null,null,150,4115.6910689566412,4123.2466119897417,4109.2393227085795,null,null,null,null,null,null,null,null,null,null,null,null,null,null,null,null,null,null,null,null,null,null,null,null,null,null,null,null,null,null,null,null,null,null,null,null,null,null,null,null,0,0,0,0,null,999,null,0]
[179,94.827586206896555,120,2011,53,42,126,0,null,null,"Unweighted Statistics",null,null,null,null,null,165,4099.7252662430328,4106.6205203027412,4093.8135751732339,null,null,null,null,null,null,null,null,null,null,null,null,null,null,null,null,null,null,null,null,null,null,null,null,null,null,null,null,null,null,null,null,null,null,null,null,null,null,null,null,0,0,0,0,null,999,null,0]
[180,93.103448275862064,160,2011,53,53,143,0,null,null,null,null,null,null,null,null,180,4075.7687258982737,4080.4280613627752,4071.7506051992173,null,null,null,null,null,null,null,null,null,null,null,null,null,null,null,null,null,null,null,null,null,null,null,null,null,null,null,null,null,null,null,null,null,null,null,null,null,null,null,null,0,0,0,0,null,999,null,0]
[181,92.063492063492063,0,2012,57,1,164,0,null,"R-squared",0.60591899999999999,"    Mean dependent var",null,93.900800000000004,null,null,null,3835.8585263794466,3763.3573299467616,3898.4495639348875,null,null,null,null,null,null,null,null,null,null,null,null,null,null,null,null,null,null,null,null,null,null,null,null,null,null,null,null,null,null,null,null,null,null,null,null,null,null,null,null,0,0,0,0,null,999,null,0]
[182,98.412698412698404,40,2012,57,14,105,0,null,"Sum squared resid",8692.2960000000003,"    Durbin-Watson stat",null,1.870458,null,null,null,3835.8585263794466,3763.3573299467616,3898.4495639348875,null,null,null,null,null,null,null,null,null,null,null,null,null,null,null,null,null,null,null,null,null,null,null,null,null,null,null,null,null,null,null,null,null,null,null,null,null,null,null,null,0,0,0,0,null,999,null,0]
[183,100,80,2012,57,31,126,0,null,null,null,null,null,null,null,null,"Disclaimer:  This software is provided ‘as is’ and without warranties as to performance or merchantability. Further, statements may have been made to you about this software, and they do not constitute warranties and shall not be relied upon by the user to use the program or act on its results. This program is provided without any expressed or implied warranties whatsoever. Because the diversity of conditions and hardware under which this program may be used, no warranty of merchantability or warranty of fitness for a particular purpose is offered. The user is advised to test the program thoroughly before relying on it. The user assumes the entire risk of using the program. The authors will not be liable for any claim or damage brought against the user by any third party, nor will the authors be liable for any consequential, indirect, or special damages suffered by the user as a result of the software.  Results pertain to silt loam soils common in major rice producing regions of the humid mid-Southern U.S.",null,null,null,null,null,null,null,null,null,null,null,null,null,null,null,null,null,null,null,null,null,null,null,null,null,null,null,null,null,null,null,null,null,null,null,null,null,null,null,null,null,null,null,0,0,0,0,null,999,null,0]
[184,96.825396825396822,120,2012,57,41,142,0,null,null,null,null,null,null,null,null,null,null,null,null,null,null,null,null,null,null,null,null,null,null,null,null,null,null,null,null,null,null,null,null,null,null,null,null,null,null,null,null,null,null,null,null,null,null,null,null,null,null,null,null,0,0,0,0,null,999,null,0]
[185,96.825396825396822,160,2012,57,52,156,0,null,null,null,null,null,null,null,null,null,null,null,null,null,null,null,null,null,null,null,null,null,null,null,null,null,null,null,null,null,null,null,null,null,null,null,null,null,null,null,null,null,null,null,null,null,null,null,null,null,null,null,null,0,0,0,0,null,999,null,0]
[186,96.875,0,2012,58,2,185,0,null,null,null,null,null,null,null,null,null,"Potash fertilizer needed @ RY = 100 if possible or K max or zero if yield max at negative K:",null,{"$f":"IF((IF(W142,K159,O159)+IF(W142,K161,O161)*($U$151+$Y$151)+IF(W142,K162,O162)*($U$151+$Y$151)^0.5)/(-2*(IF(W142,K160,O160)+IF(W142,K163,O163)*($U$151+$Y$151)^0.5+IF(W142,K164,O164)*($U$151+$Y$151)))>$Y$149,$Y$149,(IF(W142,K159,O159)+IF(W142,K161,O161)*($U$151+$Y$151)+IF(W142,K162,O162)*($U$151+$Y$151)^0.5)/(-2*(IF(W142,K160,O160)+IF(W142,K163,O163)*($U$151+$Y$151)^0.5+IF(W142,K164,O164)*($U$151+$Y$151))))","v":122.63809576700679},{"$f":"IF((IF(W142,K159,O159)+IF(W142,K161,O161)*($U$151)+IF(W142,K162,O162)*($U$151)^0.5)/(-2*(IF(W142,K160,O160)+IF(W142,K163,O163)*($U$151)^0.5+IF(W142,K164,O164)*($U$151)))>$Y$149,$Y$149,(IF(W142,K159,O159)+IF(W142,K161,O161)*($U$151)+IF(W142,K162,O162)*($U$151)^0.5)/(-2*(IF(W142,K160,O160)+IF(W142,K163,O163)*($U$151)^0.5+IF(W142,K164,O164)*($U$151))))","v":127.52942009126573},{"$f":"IF((IF(W142,K159,O159)+IF(W142,K161,O161)*($U$151-$Y$151)+IF(W142,K162,O162)*($U$151-$Y$151)^0.5)/(-2*(IF(W142,K160,O160)+IF(W142,K163,O163)*($U$151-$Y$151)^0.5+IF(W142,K164,O164)*($U$151-$Y$151)))>$Y$149,$Y$149,(IF(W142,K159,O159)+IF(W142,K161,O161)*($U$151-$Y$151)+IF(W142,K162,O162)*($U$151-$Y$151)^0.5)/(-2*(IF(W142,K160,O160)+IF(W142,K163,O163)*($U$151-$Y$151)^0.5+IF(W142,K164,O164)*($U$151-$Y$151))))","v":131.43039920898283},null,null,null,null,null,null,null,null,null,null,null,null,null,null,null,null,null,null,null,null,null,null,null,null,null,null,null,null,null,null,null,null,null,null,null,null,null,null,0,0,0,0,null,999,null,0]
[187,100,80,2012,58,32,72,0,null,null,null,null,null,null,null,null,null,null,null,{"$f":"IF(T187<0,0,IFERROR((SQRT(T191^2+4*T192*T190)-T191)/(2*T192),$Y$149))","v":167.49163620904244},{"$f":"IF(U187<0,0,IFERROR((SQRT(U191^2+4*U192*U190)-U191)/(2*U192),$Y$149))","v":167.49163620904244},{"$f":"IF(V187<0,0,IFERROR((SQRT(V191^2+4*V192*V190)-V191)/(2*V192),$Y$149))","v":167.49163620904244},null,null,null,null,null,null,null,null,null,null,null,null,null,null,null,null,null,null,null,null,null,null,null,null,null,null,null,null,null,null,null,null,null,null,null,null,null,null,0,0,0,0,null,999,null,0]
[188,89.85507246376811,0,2012,59,3,72,0,null,null,null,null,null,null,null,null,null,null,null,null,null,null,null,null,null,null,null,null,null,null,null,null,null,null,null,null,null,null,null,null,null,null,null,null,null,null,null,null,null,null,null,null,null,null,null,null,null,null,null,null,0,0,0,0,null,999,null,0]
[189,100,80,2012,59,33,72,0,null,null,null,null,null,null,null,null,null,null,"c",{"$f":"100-$K$156-$K$157*(U151+Y151)-$K$158*(U151+Y151)^0.5","v":7.597782319628152},{"$f":"100-$K$156-$K$157*U151-$K$158*U151^0.5","v":9.0813338141870759},{"$f":"100-$K$156-$K$157*(U151-Y151)-$K$158*(U151-Y151)^0.5","v":10.799778858811038},null,null,null,null,null,null,null,null,null,null,null,null,null,null,null,null,null,null,null,null,null,null,null,null,null,null,null,null,null,null,null,null,null,null,null,null,null,null,0,0,0,0,null,999,null,0]
[190,95.833333333333343,0,2012,60,4,72,0,null,null,null,null,null,null,null,null,null,null,"a",{"$f":"IF(W142,K159,O159)+IF(W142,K161,O161)*(U151+Y151)+IF(W142,K162,O162)*(U151+Y151)^0.5","v":8.5747156625970655E-2},{"$f":"IF(W142,K159,O159)+IF(W142,K161,O161)*(U151)+IF(W142,K162,O162)*(U151)^0.5","v":0.10735078203914372},{"$f":"IF(W142,K159,O159)+IF(W142,K161,O161)*(U151-Y151)+IF(W142,K162,O162)*(U151-Y151)^0.5","v":0.13244965547778342},null,null,null,null,null,null,null,null,null,null,null,null,null,null,null,null,null,null,null,null,null,null,null,null,null,null,null,null,null,null,null,null,null,null,null,null,null,null,0,0,0,0,null,999,null,0]
[191,95.833333333333343,45,2012,60,22,95,0,null,null,null,null,null,null,null,null,null,null,"b",{"$f":"+IF(W142,K160,O160)+IF(W142,K163,O163)*(U151+Y151)^0.5+IF(W142,K164,O164)*(U151+Y151)","v":-3.4959429241659479E-4},{"$f":"+IF(W142,K160,O160)+IF(W142,K163,O163)*(U151)^0.5+IF(W142,K164,O164)*(U151)","v":-4.2088634121569251E-4},{"$f":"+IF(W142,K160,O160)+IF(W142,K163,O163)*(U151-Y151)^0.5+IF(W142,K164,O164)*(U151-Y151)","v":-5.0387755144523259E-4},null,null,null,null,null,null,null,null,null,null,null,null,null,null,null,null,null,null,null,null,null,null,null,null,null,null,null,null,null,null,null,null,null,null,null,null,null,null,0,0,0,0,null,999,null,0]
[192,100,90,2012,60,39,95,0,null,null,null,null,null,null,null,null,null,null,null,null,null,null,null,null,null,null,null,null,null,null,null,null,null,null,null,null,null,null,null,null,null,null,null,null,null,null,null,null,null,null,null,null,null,null,null,null,null,null,null,null,0,0,0,0,null,999,null,0]
[193,91.755725190839698,0,2012,61,5,95,0,null,null,null,null,null,null,null,null,null,null,null,null,null,null,null,null,null,null,null,null,null,null,null,null,null,null,null,null,null,null,null,null,null,null,null,null,null,null,null,null,null,null,null,null,null,null,null,null,null,null,null,null,0,0,0,0,null,999,null,0]
[194,99.84732824427482,40,2012,61,15,64,0,null,null,null,null,null,null,null,null,null,null,null,null,null,null,null,null,null,null,null,null,null,null,null,null,null,null,null,null,null,null,null,null,null,null,null,null,null,null,null,null,null,null,null,null,null,null,null,null,null,null,null,null,0,0,0,0,null,999,null,0]
[195,97.404580152671755,80,2012,61,34,73,0,null,null,null,null,null,null,null,null,null,null,null,null,null,null,null,null,null,null,null,null,null,null,null,null,null,null,null,null,null,null,null,null,null,null,null,null,null,null,null,null,null,null,null,null,null,null,null,null,null,null,null,null,0,0,0,0,null,999,null,0]
[196,100,120,2012,61,42,78,0,null,null,null,null,null,null,null,null,null,null,null,null,null,null,null,null,null,null,null,null,null,null,null,null,null,null,null,null,null,null,null,null,null,null,null,null,null,null,null,null,null,null,null,null,null,null,null,null,null,null,null,null,0,0,0,0,null,999,null,0]
[197,98.778625954198475,160,2012,61,53,82,0,null,null,null,null,null,null,null,null,null,null,null,null,null,null,null,null,null,null,null,null,null,null,null,null,null,null,null,null,null,null,null,null,null,null,null,null,null,null,null,null,null,null,null,null,null,null,null,null,null,null,null,null,0,0,0,0,null,999,null,0]
[198,72.950819672131146,0,2013,62,1,91,0,null,null,null,null,null,null,null,null,null,null,null,null,null,null,null,null,null,null,null,null,null,null,null,null,null,null,null,null,null,null,null,null,null,null,null,null,null,null,null,null,null,null,null,null,null,null,null,null,null,null,null,null,0,0,0,0,null,999,null,0]
[199,95.491803278688522,40,2013,62,14,64,0,null,null,null,null,null,null,null,null,null,null,null,null,null,null,null,null,null,null,null,null,null,null,null,null,null,null,null,null,null,null,null,null,null,null,null,null,null,null,null,null,null,null,null,null,null,null,null,null,null,null,null,null,0,0,0,0,null,999,null,0]
[200,96.311475409836063,80,2013,62,31,71,0,null,null,null,null,null,null,null,null,null,null,null,null,null,null,null,null,null,null,null,null,null,null,null,null,null,null,null,null,null,null,null,null,null,null,null,null,null,null,null,null,null,null,null,null,null,null,null,null,null,null,null,null,0,0,0,0,null,999,null,0]
[201,99.180327868852444,120,2013,62,41,74,0,null,null,null,null,null,null,null,null,null,null,null,null,null,null,null,null,null,null,null,null,null,null,null,null,null,null,null,null,null,null,null,null,null,null,null,null,null,null,null,null,null,null,null,null,null,null,null,null,null,null,null,null,0,0,0,0,null,999,null,0]
[202,100,160,2013,62,52,81,0,null,null,null,null,null,null,null,null,null,null,null,null,null,null,null,null,null,null,null,null,null,null,null,null,null,null,null,null,null,null,null,null,null,null,null,null,null,null,null,null,null,null,null,null,null,null,null,null,null,null,null,null,0,0,0,0,null,999,null,0]
[203,93.220338983050837,0,2013,64,3,83,0,null,null,null,null,null,null,null,null,null,null,null,null,null,null,null,null,null,null,null,null,null,null,null,null,null,null,null,null,null,null,null,null,null,null,null,null,null,null,null,null,null,null,null,null,null,null,null,null,null,null,null,null,0,0,0,0,null,999,null,0]
[204,100,80,2013,64,33,80,0,null,null,null,null,null,null,null,null,null,null,null,null,null,null,null,null,null,null,null,null,null,null,null,null,null,null,null,null,null,null,null,null,null,null,null,null,null,null,null,null,null,null,null,null,null,null,null,null,null,null,null,null,0,0,0,0,null,999,null,0]
[205,86.6279069767442,0,2013,77,4,98,0,null,null,null,null,null,null,null,null,null,null,null,null,null,null,null,null,null,null,null,null,null,null,null,null,null,null,null,null,null,null,null,null,null,null,null,null,null,null,null,null,null,null,null,null,null,null,null,null,null,null,null,null,0,0,0,0,null,999,null,0]
[206,91.279069767441854,60,2013,77,23,118,0,null,null,null,null,null,null,null,null,null,null,null,null,null,null,null,null,null,null,null,null,null,null,null,null,null,null,null,null,null,null,null,null,null,null,null,null,null,null,null,null,null,null,null,null,null,null,null,null,null,null,null,null,0,0,0,0,null,999,null,0]
[207,100,120,2013,77,43,140,0,null,null,null,null,null,null,null,null,null,null,null,null,null,null,null,null,null,null,null,null,null,null,null,null,null,null,null,null,null,null,null,null,null,null,null,null,null,null,null,null,null,null,null,null,null,null,null,null,null,null,null,null,0,0,0,0,null,999,null,0]
[208,90.116279069767444,160,2013,77,54,186,0,null,null,null,null,null,null,null,null,null,null,null,null,null,null,null,null,null,null,null,null,null,null,null,null,null,null,null,null,null,null,null,null,null,null,null,null,null,null,null,null,null,null,null,null,null,null,null,null,null,null,null,null,0,0,0,0,null,999,null,0]
[209,97.814207650273204,0,2013,82,5,101,0,null,null,null,null,null,null,null,null,null,null,null,null,null,null,null,null,null,null,null,null,null,null,null,null,null,null,null,null,null,null,null,null,null,null,null,null,null,null,null,null,null,null,null,null,null,null,null,null,null,null,null,null,0,0,0,0,null,999,null,0]
[210,100,60,2013,82,24,101,0,null,null,null,null,null,null,null,null,null,null,null,null,null,null,null,null,null,null,null,null,null,null,null,null,null,null,null,null,null,null,null,null,null,null,null,null,null,null,null,null,null,null,null,null,null,null,null,null,null,null,null,null,0,0,0,0,null,999,null,0]
[211,96.038251366120207,120,2013,82,44,83,0,null,null,null,null,null,null,null,null,null,null,null,null,null,null,null,null,null,null,null,null,null,null,null,null,null,null,null,null,null,null,null,null,null,null,null,null,null,null,null,null,null,null,null,null,null,null,null,null,null,null,null,null,0,0,0,0,null,999,null,0]
[212,94.945355191256837,160,2013,82,55,83,0,null,null,null,null,null,null,null,null,null,null,null,null,null,null,null,null,null,null,null,null,null,null,null,null,null,null,null,null,null,null,null,null,null,null,null,null,null,null,null,null,null,null,null,null,null,null,null,null,null,null,null,null,0,0,0,0,null,999,null,0]
[213,97.795071335927389,0,2013,83,6,83,1,null,null,null,null,null,null,null,null,null,null,null,null,null,null,null,null,null,null,null,null,null,null,null,null,null,null,null,null,null,null,null,null,null,null,null,null,null,null,null,null,null,null,null,null,null,null,null,null,null,null,null,null,0,0,0,0,null,999,null,0]
[214,100,60,2013,83,25,83,1,null,null,null,null,null,null,null,null,null,null,null,null,null,null,null,null,null,null,null,null,null,null,null,null,null,null,null,null,null,null,null,null,null,null,null,null,null,null,null,null,null,null,null,null,null,null,null,null,null,null,null,null,92.028985507246404,3882.70289855073,0,108,null,3882.70289855073,null,0]
[215,98.313878080415051,120,2013,83,45,131,1,null,null,null,null,null,null,null,null,null,null,null,null,null,null,null,null,null,null,null,null,null,null,null,null,null,null,null,null,null,null,null,null,null,null,null,null,null,null,null,null,null,null,null,null,null,null,null,null,null,null,null,null,94.565217391304301,3989.70652173913,40,108,null,3989.70652173913,null,37.220363602009435]
[216,98.054474708171199,160,2013,83,56,131,1,null,null,null,null,null,null,null,null,null,null,null,null,null,null,null,null,null,null,null,null,null,null,null,null,null,null,null,null,null,null,null,null,null,null,null,null,null,null,null,null,null,null,null,null,null,null,null,null,null,null,null,null,99.094202898550705,4180.7844202898495,80,108,null,4180.7844202898495,null,74.44072720401887]
[217,100.12165450121653,0,2013,87,7,131,1,null,null,null,null,null,null,null,null,null,null,null,null,null,null,null,null,null,null,null,null,null,null,null,null,null,null,null,null,null,null,null,null,null,null,null,null,null,null,null,null,null,null,null,null,null,null,null,null,null,null,null,null,79.891304347826093,3370.6141304347798,120,108,null,3370.6141304347798,null,111.6610908060283]
[218,99.026763990267639,60,2013,87,26,131,1,null,null,null,null,null,null,null,null,null,null,null,null,null,null,null,null,null,null,null,null,null,null,null,null,null,null,null,null,null,null,null,null,null,null,null,null,null,null,null,null,null,null,null,null,null,null,null,null,null,null,null,null,100,4219,160,108,null,4219,null,148.88145440803774]
[219,99.513381995133813,120,2013,87,46,353,1,null,null,null,null,null,null,null,null,null,null,null,null,null,null,null,null,null,null,null,null,null,null,null,null,null,null,null,null,null,null,null,null,null,null,null,null,null,null,null,null,null,null,null,null,null,null,null,null,null,null,null,null,0,0,0,0,null,999,null,0]
[220,100,160,2013,87,57,353,1,null,null,null,null,null,null,null,null,null,null,null,null,null,null,null,null,null,null,null,null,null,null,null,null,null,null,null,null,null,null,null,null,null,null,null,null,null,null,null,null,null,null,null,null,null,null,null,null,null,null,null,null,0,0,0,0,null,999,null,0]
[221,97.846567967698533,0,2013,88,8,353,1,null,null,null,null,null,null,null,null,null,null,null,null,null,null,null,null,null,null,null,null,null,null,null,null,null,null,null,null,null,null,null,null,null,null,null,null,null,null,null,null,null,null,null,null,null,null,null,null,null,null,null,null,0,0,0,0,null,999,null,0]
[222,97.711978465679678,60,2013,88,27,353,1,null,null,null,null,null,null,null,null,null,null,null,null,null,null,null,null,null,null,null,null,null,null,null,null,null,null,null,null,null,null,null,null,null,null,null,null,null,null,null,null,null,null,null,null,null,null,null,null,null,null,null,null,0,0,0,0,null,999,null,0]
[223,100,120,2013,88,47,157,1,null,null,null,null,null,null,null,null,null,null,null,null,null,null,null,null,null,null,null,null,null,null,null,null,null,null,null,null,null,null,null,null,null,null,null,null,null,null,null,null,null,null,null,null,null,null,null,null,null,null,null,null,0,0,0,0,null,999,null,0]
[224,99.461641991924637,160,2013,88,58,157,1,null,null,null,null,null,null,null,null,null,null,null,null,null,null,null,null,null,null,null,null,null,null,null,null,null,null,null,null,null,null,null,null,null,null,null,null,null,null,null,null,null,null,null,null,null,null,null,null,null,null,null,null,92.508710801393704,3902.9425087108002,0,104,null,3902.9425087108002,null,0]
[225,90.398126463700237,0,2013,90,9,157,0,null,null,null,null,null,null,null,null,null,null,null,null,null,null,null,null,null,null,null,null,null,null,null,null,null,null,null,null,null,null,null,null,null,null,null,null,null,null,null,null,null,null,null,null,null,null,null,null,null,null,null,null,95.470383275261298,4027.8954703832701,40,104,null,4027.8954703832701,null,37.220363602009435]
[226,96.370023419203733,60,2013,90,28,157,0,null,null,null,null,null,null,null,null,null,null,null,null,null,null,null,null,null,null,null,null,null,null,null,null,null,null,null,null,null,null,null,null,null,null,null,null,null,null,null,null,null,null,null,null,null,null,null,null,null,null,null,null,95.470383275261298,4027.8954703832701,80,104,null,4027.8954703832701,null,74.44072720401887]
[227,96.604215456674467,120,2013,90,48,330,0,null,null,null,null,null,null,null,null,null,null,null,null,null,null,null,null,null,null,null,null,null,null,null,null,null,null,null,null,null,null,null,null,null,null,null,null,null,null,null,null,null,null,null,null,null,null,null,null,null,null,null,null,99.3031358885017,4189.5993031358903,120,104,null,4189.5993031358903,null,111.6610908060283]
[228,100,160,2013,90,59,330,0,null,null,null,null,null,null,null,null,null,null,null,null,null,null,null,null,null,null,null,null,null,null,null,null,null,null,null,null,null,null,null,null,null,null,null,null,null,null,null,null,null,null,null,null,null,null,null,null,null,null,null,null,100,4219,160,104,null,4219,null,148.88145440803774]
[229,82.587859424920126,0,2014,66,1,330,0,null,null,null,null,null,null,null,null,null,null,null,null,null,null,null,null,null,null,null,null,null,null,null,null,null,null,null,null,null,null,null,null,null,null,null,null,null,null,null,null,null,null,null,null,null,null,null,null,null,null,null,null,0,0,0,0,null,999,null,0]
[230,100,80,2014,66,31,330,0,null,null,null,null,null,null,null,null,null,null,null,null,null,null,null,null,null,null,null,null,null,null,null,null,null,null,null,null,null,null,null,null,null,null,null,null,null,null,null,null,null,null,null,null,null,null,null,null,null,null,null,null,0,0,0,0,null,999,null,0]
[231,87.35177865612647,0,2014,67,2,96,0,null,null,null,null,null,null,null,null,null,null,null,null,null,null,null,null,null,null,null,null,null,null,null,null,null,null,null,null,null,null,null,null,null,null,null,null,null,null,null,null,null,null,null,null,null,null,null,null,null,null,null,null,0,0,0,0,null,999,null,0]
[232,95.915678524374172,40,2014,67,14,96,0,null,null,null,null,null,null,null,null,null,null,null,null,null,null,null,null,null,null,null,null,null,null,null,null,null,null,null,null,null,null,null,null,null,null,null,null,null,null,null,null,null,null,null,null,null,null,null,null,null,null,null,null,0,0,0,0,null,999,null,0]
[233,93.280632411067188,80,2014,67,32,96,0,null,null,null,null,null,null,null,null,null,null,null,null,null,null,null,null,null,null,null,null,null,null,null,null,null,null,null,null,null,null,null,null,null,null,null,null,null,null,null,null,null,null,null,null,null,null,null,null,null,null,null,null,0,0,0,0,null,999,null,0]
[234,97.891963109354407,120,2014,67,41,96,0,null,null,null,null,null,null,null,null,null,null,null,null,null,null,null,null,null,null,null,null,null,null,null,null,null,null,null,null,null,null,null,null,null,null,null,null,null,null,null,null,null,null,null,null,null,null,null,null,null,null,null,null,0,0,0,0,null,999,null,0]
[235,100,160,2014,67,52,58,0,null,null,null,null,null,null,null,null,null,null,null,null,null,null,null,null,null,null,null,null,null,null,null,null,null,null,null,null,null,null,null,null,null,null,null,null,null,null,null,null,null,null,null,null,null,null,null,null,null,null,null,null,0,0,0,0,null,999,null,0]
[236,83.136593591905566,0,2014,68,3,58,0,null,null,null,null,null,null,null,null,null,null,null,null,null,null,null,null,null,null,null,null,null,null,null,null,null,null,null,null,null,null,null,null,null,null,null,null,null,null,null,null,null,null,null,null,null,null,null,null,null,null,null,null,0,0,0,0,null,999,null,0]
[237,92.748735244519395,40,2014,68,15,99,0,null,null,null,null,null,null,null,null,null,null,null,null,null,null,null,null,null,null,null,null,null,null,null,null,null,null,null,null,null,null,null,null,null,null,null,null,null,null,null,null,null,null,null,null,null,null,null,null,null,null,null,null,0,0,0,0,null,999,null,0]
[238,96.627318718381119,80,2014,68,33,99,0,null,null,null,null,null,null,null,null,null,null,null,null,null,null,null,null,null,null,null,null,null,null,null,null,null,null,null,null,null,null,null,null,null,null,null,null,null,null,null,null,null,null,null,null,null,null,null,null,null,null,null,null,0,0,0,0,null,999,null,0]
[239,100,120,2014,68,42,99,0,null,null,null,null,null,null,null,null,null,null,null,null,null,null,null,null,null,null,null,null,null,null,null,null,null,null,null,null,null,null,null,null,null,null,null,null,null,null,null,null,null,null,null,null,null,null,null,null,null,null,null,null,{"$f":"_xlfn.NUMBERVALUE(IF(AND($G67>=($U$151-$Y$151),$G67<=($U$151+$Y$151)),B67,\"\"))","v":79.685039370078698},{"$f":"_xlfn.NUMBERVALUE(IFERROR(+BI240*$W$149,\"\"))","v":3361.91181102362},{"$f":"_xlfn.NUMBERVALUE(IF(AND($G67>=($U$151-$Y$151),$G67<=($U$151+$Y$151)),C67,\"\"))","v":0},{"$f":"_xlfn.NUMBERVALUE(IF(AND($G67>=($U$151-$Y$151),$G67<=($U$151+$Y$151)),G67,\"\"))","v":103},null,{"$f":"IF(BJ240=0,999,BJ240)","v":3361.91181102362},null,{"$f":"+BK240*$BP$172","v":0}]
[240,98.145025295109619,160,2014,68,53,99,0,null,null,null,null,null,null,null,null,null,null,null,null,null,null,null,null,null,null,null,null,null,null,null,null,null,null,null,null,null,null,null,null,null,null,null,null,null,null,null,null,null,null,null,null,null,null,null,null,null,null,null,null,87.559055118110194,3694.1165354330701,40,108,null,3694.1165354330701,null,37.220363602009435]
[241,77.286585365853668,0,2014,78,4,99,0,null,null,null,null,null,null,null,null,null,null,null,null,null,null,null,null,null,null,null,null,null,null,null,null,null,null,null,null,null,null,null,null,null,null,null,null,null,null,null,null,null,null,null,null,null,null,null,null,null,null,null,null,92.755905511810994,3913.37165354331,80,118,null,3913.37165354331,null,74.44072720401887]
[242,89.176829268292693,60,2014,78,23,73,0,null,null,null,null,null,null,null,null,null,null,null,null,null,null,null,null,null,null,null,null,null,null,null,null,null,null,null,null,null,null,null,null,null,null,null,null,null,null,null,null,null,null,null,null,null,null,null,null,null,null,null,null,0,0,0,0,null,999,null,0]
[243,97.408536585365852,120,2014,78,43,83,0,null,null,null,null,null,null,null,null,null,null,null,null,null,null,null,null,null,null,null,null,null,null,null,null,null,null,null,null,null,null,null,null,null,null,null,null,null,null,null,null,null,null,null,null,null,null,null,null,null,null,null,null,0,0,0,0,null,999,null,0]
[244,100,160,2014,78,54,87,0,null,null,null,null,null,null,null,null,null,null,null,null,null,null,null,null,null,null,null,null,null,null,null,null,null,null,null,null,null,null,null,null,null,null,null,null,null,null,null,null,null,null,null,null,null,null,null,null,null,null,null,null,0,0,0,0,null,999,null,0]
[245,100.68027210884354,0,2014,79,5,100,0,null,null,null,null,null,null,null,null,null,null,null,null,null,null,null,null,null,null,null,null,null,null,null,null,null,null,null,null,null,null,null,null,null,null,null,null,null,null,null,null,null,null,null,null,null,null,null,null,null,null,null,null,0,0,0,0,null,999,null,0]
[246,97.61904761904762,60,2014,79,24,125,0,null,null,null,null,null,null,null,null,null,null,null,null,null,null,null,null,null,null,null,null,null,null,null,null,null,null,null,null,null,null,null,null,null,null,null,null,null,null,null,null,null,null,null,null,null,null,null,null,null,null,null,null,0,0,0,0,null,999,null,0]
[247,98.639455782312936,120,2014,79,44,60,0,null,null,null,null,null,null,null,null,null,null,null,null,null,null,null,null,null,null,null,null,null,null,null,null,null,null,null,null,null,null,null,null,null,null,null,null,null,null,null,null,null,null,null,null,null,null,null,null,null,null,null,null,97.847682119205302,4128.1937086092703,120,111,null,4128.1937086092703,null,111.6610908060283]
[248,100,160,2014,79,55,60,0,null,null,null,null,null,null,null,null,null,null,null,null,null,null,null,null,null,null,null,null,null,null,null,null,null,null,null,null,null,null,null,null,null,null,null,null,null,null,null,null,null,null,null,null,null,null,null,null,null,null,null,null,100,4219,160,123,null,4219,null,148.88145440803774]
[249,94.182389937106919,0,2014,80,6,60,0,null,null,null,null,null,null,null,null,null,null,null,null,null,null,null,null,null,null,null,null,null,null,null,null,null,null,null,null,null,null,null,null,null,null,null,null,null,null,null,null,null,null,null,null,null,null,null,null,null,null,null,null,0,0,0,0,null,999,null,0]
[250,96.698113207547166,60,2014,80,25,60,0,null,null,null,null,null,null,null,null,null,null,null,null,null,null,null,null,null,null,null,null,null,null,null,null,null,null,null,null,null,null,null,null,null,null,null,null,null,null,null,null,null,null,null,null,null,null,null,null,null,null,null,null,0,0,0,0,null,999,null,0]
[251,99.371069182389931,120,2014,80,45,78,0,null,null,null,null,null,null,null,null,null,null,null,null,null,null,null,null,null,null,null,null,null,null,null,null,null,null,null,null,null,null,null,null,null,null,null,null,null,null,null,null,null,null,null,null,null,null,null,null,null,null,null,null,0,0,0,0,null,999,null,0]
[252,100,160,2014,80,56,78,0,null,null,null,null,null,null,null,null,null,null,null,null,null,null,null,null,null,null,null,null,null,null,null,null,null,null,null,null,null,null,null,null,null,null,null,null,null,null,null,null,null,null,null,null,null,null,null,null,null,null,null,null,0,0,0,0,null,999,null,0]
[253,93.28743545611016,0,2014,81,7,78,0,null,null,null,null,null,null,null,null,null,null,null,null,null,null,null,null,null,null,null,null,null,null,null,null,null,null,null,null,null,null,null,null,null,null,null,null,null,null,null,null,null,null,null,null,null,null,null,null,null,null,null,null,0,0,0,0,null,999,null,0]
[254,100,60,2014,81,26,78,0,null,null,null,null,null,null,null,null,null,null,null,null,null,null,null,null,null,null,null,null,null,null,null,null,null,null,null,null,null,null,null,null,null,null,null,null,null,null,null,null,null,null,null,null,null,null,null,null,null,null,null,null,0,0,0,0,null,999,null,0]
[255,97.934595524956976,120,2014,81,46,76,0,null,null,null,null,null,null,null,null,null,null,null,null,null,null,null,null,null,null,null,null,null,null,null,null,null,null,null,null,null,null,null,null,null,null,null,null,null,null,null,null,null,null,null,null,null,null,null,null,null,null,null,null,0,0,0,0,null,999,null,0]
[256,97.590361445783131,160,2014,81,57,76,0,null,null,null,null,null,null,null,null,null,null,null,null,null,null,null,null,null,null,null,null,null,null,null,null,null,null,null,null,null,null,null,null,null,null,null,null,null,null,null,null,null,null,null,null,null,null,null,null,null,null,null,null,0,0,0,0,null,999,null,0]
[257,97.025495750708217,0,2014,84,8,76,0,null,null,null,null,null,null,null,null,null,null,null,null,null,null,null,null,null,null,null,null,null,null,null,null,null,null,null,null,null,null,null,null,null,null,null,null,null,null,null,null,null,null,null,null,null,null,null,null,null,null,null,null,0,0,0,0,null,999,null,0]
[258,100,60,2014,84,27,76,0,null,null,null,null,null,null,null,null,null,null,null,null,null,null,null,null,null,null,null,null,null,null,null,null,null,null,null,null,null,null,null,null,null,null,null,null,null,null,null,null,null,null,null,null,null,null,null,null,null,null,null,null,0,0,0,0,null,999,null,0]
[259,95.75070821529745,120,2014,84,47,72,0,null,null,null,null,null,null,null,null,null,null,null,null,null,null,null,null,null,null,null,null,null,null,null,null,null,null,null,null,null,null,null,null,null,null,null,null,null,null,null,null,null,null,null,null,null,null,null,null,null,null,null,null,82.853025936599394,3495.56916426513,0,113,null,3495.56916426513,null,0]
[260,95.892351274787544,160,2014,84,58,72,0,null,null,null,null,null,null,null,null,null,null,null,null,null,null,null,null,null,null,null,null,null,null,null,null,null,null,null,null,null,null,null,null,null,null,null,null,null,null,null,null,null,null,null,null,null,null,null,null,null,null,null,null,92.939481268011505,3921.1167146974099,40,113,null,3921.1167146974099,null,37.220363602009435]
[261,90.619765494137354,0,2014,85,9,72,1,null,null,null,null,null,null,null,null,null,null,null,null,null,null,null,null,null,null,null,null,null,null,null,null,null,null,null,null,null,null,null,null,null,null,null,null,null,null,null,null,null,null,null,null,null,null,null,null,null,null,null,null,91.642651296829996,3866.4034582132599,80,113,null,3866.4034582132599,null,74.44072720401887]
[262,100,60,2014,85,28,72,1,null,null,null,null,null,null,null,null,null,null,null,null,null,null,null,null,null,null,null,null,null,null,null,null,null,null,null,null,null,null,null,null,null,null,null,null,null,null,null,null,null,null,null,null,null,null,null,null,null,null,null,null,100,4219,120,113,null,4219,null,111.6610908060283]
[263,96.314907872696807,120,2014,85,48,161,1,null,null,null,null,null,null,null,null,null,null,null,null,null,null,null,null,null,null,null,null,null,null,null,null,null,null,null,null,null,null,null,null,null,null,null,null,null,null,null,null,null,null,null,null,null,null,null,null,null,null,null,null,91.9308357348703,3878.5619596541801,160,113,null,3878.5619596541801,null,148.88145440803774]
[264,94.9748743718593,160,2014,85,59,161,1,null,null,null,null,null,null,null,null,null,null,null,null,null,null,null,null,null,null,null,null,null,null,null,null,null,null,null,null,null,null,null,null,null,null,null,null,null,null,null,null,null,null,null,null,null,null,null,null,null,null,null,null,0,0,0,0,null,999,null,0]
[265,96.8888888888889,0,2014,86,10,161,1,null,null,null,null,null,null,null,null,null,null,null,null,null,null,null,null,null,null,null,null,null,null,null,null,null,null,null,null,null,null,null,null,null,null,null,null,null,null,null,null,null,null,null,null,null,null,null,null,null,null,null,null,0,0,0,0,null,999,null,0]
[266,100,60,2014,86,29,161,1,null,null,null,null,null,null,null,null,null,null,null,null,null,null,null,null,null,null,null,null,null,null,null,null,null,null,null,null,null,null,null,null,null,null,null,null,null,null,null,null,null,null,null,null,null,null,null,null,null,null,null,null,0,0,0,0,null,999,null,0]
[267,97.481481481481481,120,2014,86,49,146,1,null,null,null,null,null,null,null,null,null,null,null,null,null,null,null,null,null,null,null,null,null,null,null,null,null,null,null,null,null,null,null,null,null,null,null,null,null,null,null,null,null,null,null,null,null,null,null,null,null,null,null,null,0,0,0,0,null,999,null,0]
[268,95.851851851851848,160,2014,86,60,146,1,null,null,null,null,null,null,null,null,null,null,null,null,null,null,null,null,null,null,null,null,null,null,null,null,null,null,null,null,null,null,null,null,null,null,null,null,null,null,null,null,null,null,null,null,null,null,null,null,null,null,null,null,0,0,0,0,null,999,null,0]
[269,98.171846435100548,0,2014,89,11,146,1,null,null,null,null,null,null,null,null,null,null,null,null,null,null,null,null,null,null,null,null,null,null,null,null,null,null,null,null,null,null,null,null,null,null,null,null,null,null,null,null,null,null,null,null,null,null,null,null,null,null,null,null,0,0,0,0,null,999,null,0]
[270,97.806215722120655,60,2014,89,30,146,1,null,null,null,null,null,null,null,null,null,null,null,null,null,null,null,null,null,null,null,null,null,null,null,null,null,null,null,null,null,null,null,null,null,null,null,null,null,null,null,null,null,null,null,null,null,null,null,null,null,null,null,null,0,0,0,0,null,999,null,0]
[271,100,120,2014,89,50,201,1,null,null,null,null,null,null,null,null,null,null,null,null,null,null,null,null,null,null,null,null,null,null,null,null,null,null,null,null,null,null,null,null,null,null,null,null,null,null,null,null,null,null,null,null,null,null,null,null,null,null,null,null,0,0,0,0,null,999,null,0]
[272,96.160877513711156,160,2014,89,61,201,1,null,null,null,null,null,null,null,null,null,null,null,null,null,null,null,null,null,null,null,null,null,null,null,null,null,null,null,null,null,null,null,null,null,null,null,null,null,null,null,null,null,null,null,null,null,null,null,null,null,null,null,null,0,0,0,0,null,999,null,0]
[273,71.208226221079698,0,2015,69,1,201,0,null,null,null,null,null,null,null,null,null,null,null,null,null,null,null,null,null,null,null,null,null,null,null,null,null,null,null,null,null,null,null,null,null,null,null,null,null,null,null,null,null,null,null,null,null,null,null,null,null,null,null,null,0,0,0,0,null,999,null,0]
[274,88.431876606683801,40,2015,69,14,201,0,null,null,null,null,null,null,null,null,null,null,null,null,null,null,null,null,null,null,null,null,null,null,null,null,null,null,null,null,null,null,null,null,null,null,null,null,null,null,null,null,null,null,null,null,null,null,null,null,null,null,null,null,0,0,0,0,null,999,null,0]
[275,95.758354755784069,80,2015,69,31,267,0,null,null,null,null,null,null,null,null,null,null,null,null,null,null,null,null,null,null,null,null,null,null,null,null,null,null,null,null,null,null,null,null,null,null,null,null,null,null,null,null,null,null,null,null,null,null,null,null,null,null,null,null,0,0,0,0,null,999,null,0]
[276,99.485861182519287,120,2015,69,41,267,0,null,null,null,null,null,null,null,null,null,null,null,null,null,null,null,null,null,null,null,null,null,null,null,null,null,null,null,null,null,null,null,null,null,null,null,null,null,null,null,null,null,null,null,null,null,null,null,null,null,null,null,null,0,0,0,0,null,999,null,0]
[277,100,160,2015,69,52,267,0,null,null,null,null,null,null,null,null,null,null,null,null,null,null,null,null,null,null,null,null,null,null,null,null,null,null,null,null,null,null,null,null,null,null,null,null,null,null,null,null,null,null,null,null,null,null,null,null,null,null,null,null,0,0,0,0,null,999,null,0]
[278,85.873192436040043,0,2015,70,2,267,0,null,null,null,null,null,null,null,null,null,null,null,null,null,null,null,null,null,null,null,null,null,null,null,null,null,null,null,null,null,null,null,null,null,null,null,null,null,null,null,null,null,null,null,null,null,null,null,null,null,null,null,null,0,0,0,0,null,999,null,0]
[279,89.432703003337039,40,2015,70,15,35,0,null,null,null,null,null,null,null,null,null,null,null,null,null,null,null,null,null,null,null,null,null,null,null,null,null,null,null,null,null,null,null,null,null,null,null,null,null,null,null,null,null,null,null,null,null,null,null,null,null,null,null,null,0,0,0,0,null,999,null,0]
[280,92.213570634037822,80,2015,70,32,41,0,null,null,null,null,null,null,null,null,null,null,null,null,null,null,null,null,null,null,null,null,null,null,null,null,null,null,null,null,null,null,null,null,null,null,null,null,null,null,null,null,null,null,null,null,null,null,null,null,null,null,null,null,0,0,0,0,null,999,null,0]
[281,95.216907675194648,120,2015,70,42,49,0,null,null,null,null,null,null,null,null,null,null,null,null,null,null,null,null,null,null,null,null,null,null,null,null,null,null,null,null,null,null,null,null,null,null,null,null,null,null,null,null,null,null,null,null,null,null,null,null,null,null,null,null,0,0,0,0,null,999,null,0]
[282,100,160,2015,70,53,55,0,null,null,null,null,null,null,null,null,null,null,null,null,null,null,null,null,null,null,null,null,null,null,null,null,null,null,null,null,null,null,null,null,null,null,null,null,null,null,null,null,null,null,null,null,null,null,null,null,null,null,null,null,0,0,0,0,null,999,null,0]
[283,69.749216300940446,0,2015,71,3,64,0,null,null,null,null,null,null,null,null,null,null,null,null,null,null,null,null,null,null,null,null,null,null,null,null,null,null,null,null,null,null,null,null,null,null,null,null,null,null,null,null,null,null,null,null,null,null,null,null,null,null,null,null,0,0,0,0,null,999,null,0]
[284,88.087774294670851,60,2015,71,23,86,0,null,null,null,null,null,null,null,null,null,null,null,null,null,null,null,null,null,null,null,null,null,null,null,null,null,null,null,null,null,null,null,null,null,null,null,null,null,null,null,null,null,null,null,null,null,null,null,null,null,null,null,null,0,0,0,0,null,999,null,0]
[285,100,120,2015,71,43,100,0,null,null,null,null,null,null,null,null,null,null,null,null,null,null,null,null,null,null,null,null,null,null,null,null,null,null,null,null,null,null,null,null,null,null,null,null,null,null,null,null,null,null,null,null,null,null,null,null,null,null,null,null,0,0,0,0,null,999,null,0]
[286,88.768115942028984,0,2015,74,4,117,0,null,null,null,null,null,null,null,null,null,null,null,null,null,null,null,null,null,null,null,null,null,null,null,null,null,null,null,null,null,null,null,null,null,null,null,null,null,null,null,null,null,null,null,null,null,null,null,null,null,null,null,null,0,0,0,0,null,999,null,0]
[287,96.376811594202891,60,2015,74,24,141,0,null,null,null,null,null,null,null,null,null,null,null,null,null,null,null,null,null,null,null,null,null,null,null,null,null,null,null,null,null,null,null,null,null,null,null,null,null,null,null,null,null,null,null,null,null,null,null,null,null,null,null,null,0,0,0,0,null,999,null,0]
[288,100,120,2015,74,44,173,0,null,null,null,null,null,null,null,null,null,null,null,null,null,null,null,null,null,null,null,null,null,null,null,null,null,null,null,null,null,null,null,null,null,null,null,null,null,null,null,null,null,null,null,null,null,null,null,null,null,null,null,null,0,0,0,0,null,999,null,0]
[289,97.644927536231876,160,2015,74,54,35,0,null,null,null,null,null,null,null,null,null,null,null,null,null,null,null,null,null,null,null,null,null,null,null,null,null,null,null,null,null,null,null,null,null,null,null,null,null,null,null,null,null,null,null,null,null,null,null,null,null,null,null,null,0,0,0,0,null,999,null,0]
[290,89.2249527410208,0,2015,75,5,35,0,null,null,null,null,null,null,null,null,null,null,null,null,null,null,null,null,null,null,null,null,null,null,null,null,null,null,null,null,null,null,null,null,null,null,null,null,null,null,null,null,null,null,null,null,null,null,null,null,null,null,null,null,0,0,0,0,null,999,null,0]
[291,90.170132325141779,60,2015,75,25,35,0,null,null,null,null,null,null,null,null,null,null,null,null,null,null,null,null,null,null,null,null,null,null,null,null,null,null,null,null,null,null,null,null,null,null,null,null,null,null,null,null,null,null,null,null,null,null,null,null,null,null,null,null,0,0,0,0,null,999,null,0]
[292,98.487712665406434,120,2015,75,45,88,0,null,null,null,null,null,null,null,null,null,null,null,null,null,null,null,null,null,null,null,null,null,null,null,null,null,null,null,null,null,null,null,null,null,null,null,null,null,null,null,null,null,null,null,null,null,null,null,null,null,null,null,null,0,0,0,0,null,999,null,0]
[293,100,160,2015,75,55,88,0,null,null,null,null,null,null,null,null,null,null,null,null,null,null,null,null,null,null,null,null,null,null,null,null,null,null,null,null,null,null,null,null,null,null,null,null,null,null,null,null,null,null,null,null,null,null,null,null,null,null,null,null,0,0,0,0,null,999,null,0]
[294,97.035881435257423,0,2015,76,6,88,0,null,null,null,null,null,null,null,null,null,null,null,null,null,null,null,null,null,null,null,null,null,null,null,null,null,null,null,null,null,null,null,null,null,null,null,null,null,null,null,null,null,null,null,null,null,null,null,null,null,null,null,null,89.617486338797804,3780.9617486338798,0,114,null,3780.9617486338798,null,0]
[295,92.355694227769121,60,2015,76,26,88,0,null,null,null,null,null,null,null,null,null,null,null,null,null,null,null,null,null,null,null,null,null,null,null,null,null,null,null,null,null,null,null,null,null,null,null,null,null,null,null,null,null,null,null,null,null,null,null,null,null,null,null,null,91.6666666666667,3867.4166666666702,40,114,null,3867.4166666666702,null,37.220363602009435]
[296,96.567862714508593,120,2015,76,46,94,0,null,null,null,null,null,null,null,null,null,null,null,null,null,null,null,null,null,null,null,null,null,null,null,null,null,null,null,null,null,null,null,null,null,null,null,null,null,null,null,null,null,null,null,null,null,null,null,null,null,null,null,null,87.295081967213093,3682.97950819672,80,114,null,3682.97950819672,null,74.44072720401887]
[297,100,160,2015,76,56,94,0,null,null,null,null,null,null,null,null,null,null,null,null,null,null,null,null,null,null,null,null,null,null,null,null,null,null,null,null,null,null,null,null,null,null,null,null,null,null,null,null,null,null,null,null,null,null,null,null,null,null,null,null,98.360655737704903,4149.8360655737697,120,114,null,4149.8360655737697,null,111.6610908060283]
[298,88.095238095238088,0,2015,91,7,94,0,null,null,null,null,null,null,null,null,null,null,null,null,null,null,null,null,null,null,null,null,null,null,null,null,null,null,null,null,null,null,null,null,null,null,null,null,null,null,null,null,null,null,null,null,null,null,null,null,null,null,null,null,100,4219,160,114,null,4219,null,148.88145440803774]
[299,90.674603174603192,60,2015,91,27,94,0,null,null,null,null,null,null,null,null,null,null,null,null,null,null,null,null,null,null,null,null,null,null,null,null,null,null,null,null,null,null,null,null,null,null,null,null,null,null,null,null,null,null,null,null,null,null,null,null,null,null,null,null,0,0,0,0,null,999,null,0]
[300,99.007936507936506,120,2015,91,47,102,0,null,null,null,null,null,null,null,null,null,null,null,null,null,null,null,null,null,null,null,null,null,null,null,null,null,null,null,null,null,null,null,null,null,null,null,null,null,null,null,null,null,null,null,null,null,null,null,null,null,null,null,null,0,0,0,0,null,999,null,0]
[301,100,160,2015,91,57,102,0,null,null,null,null,null,null,null,null,null,null,null,null,null,null,null,null,null,null,null,null,null,null,null,null,null,null,null,null,null,null,null,null,null,null,null,null,null,null,null,null,null,null,null,null,null,null,null,null,null,null,null,null,0,0,0,0,null,999,null,0]
[302,96.786389413988658,0,2015,92,8,102,1,null,null,null,null,null,null,null,null,null,null,null,null,null,null,null,null,null,null,null,null,null,null,null,null,null,null,null,null,null,null,null,null,null,null,null,null,null,null,null,null,null,null,null,null,null,null,null,null,null,null,null,null,0,0,0,0,null,999,null,0]
[303,100,60,2015,92,28,102,1,null,null,null,null,null,null,null,null,null,null,null,null,null,null,null,null,null,null,null,null,null,null,null,null,null,null,null,null,null,null,null,null,null,null,null,null,null,null,null,null,null,null,null,null,null,null,null,null,null,null,null,null,{"$f":"_xlfn.NUMBERVALUE(IF(AND($G131>=($U$151-$Y$151),$G131<=($U$151+$Y$151)),B131,\"\"))","v":0},{"$f":"_xlfn.NUMBERVALUE(IFERROR(+BI304*$W$149,\"\"))","v":0},{"$f":"_xlfn.NUMBERVALUE(IF(AND($G131>=($U$151-$Y$151),$G131<=($U$151+$Y$151)),C131,\"\"))","v":0},{"$f":"_xlfn.NUMBERVALUE(IF(AND($G131>=($U$151-$Y$151),$G131<=($U$151+$Y$151)),G131,\"\"))","v":0},null,{"$f":"IF(BJ304=0,999,BJ304)","v":999},null,{"$f":"+BK304*$BP$172","v":0}]
[304,99.243856332703217,120,2015,92,48,69,1,null,null,null,null,null,null,null,null,null,null,null,null,null,null,null,null,null,null,null,null,null,null,null,null,null,null,null,null,null,null,null,null,null,null,null,null,null,null,null,null,null,null,null,null,null,null,null,null,null,null,null,null,0,0,0,0,null,999,null,0]
[305,98.67674858223063,160,2015,92,58,69,1,null,null,null,null,null,null,null,null,null,null,null,null,null,null,null,null,null,null,null,null,null,null,null,null,null,null,null,null,null,null,null,null,null,null,null,null,null,null,null,null,null,null,null,null,null,null,null,null,null,null,null,null,0,0,0,0,null,999,null,0]
[306,86.379928315412187,0,2015,93,9,69,0,null,null,null,null,null,null,null,null,null,null,null,null,null,null,null,null,null,null,null,null,null,null,null,null,null,null,null,null,null,null,null,null,null,null,null,null,null,null,null,null,null,null,null,null,null,null,null,null,null,null,null,null,0,0,0,0,null,999,null,0]
[307,96.057347670250905,60,2015,93,29,69,0,null,null,null,null,null,null,null,null,null,null,null,null,null,null,null,null,null,null,null,null,null,null,null,null,null,null,null,null,null,null,null,null,null,null,null,null,null,null,null,null,null,null,null,null,null,null,null,null,null,null,null,null,0,0,0,0,null,999,null,0]
[308,99.283154121863802,120,2015,93,49,252,0,null,null,null,null,null,null,null,null,null,null,null,null,null,null,null,null,null,null,null,null,null,null,null,null,null,null,null,null,null,null,null,null,null,null,null,null,null,null,null,null,null,null,null,null,null,null,null,null,null,null,null,null,0,0,0,0,null,999,null,0]
[309,100,160,2015,93,59,252,0,null,null,null,null,null,null,null,null,null,null,null,null,null,null,null,null,null,null,null,null,null,null,null,null,null,null,null,null,null,null,null,null,null,null,null,null,null,null,null,null,null,null,null,null,null,null,null,null,null,null,null,null,81.415929203539804,3434.9380530973399,0,110,null,3434.9380530973399,null,0]
[310,101.63636363636364,0,2015,95,10,252,1,null,null,null,null,null,null,null,null,null,null,null,null,null,null,null,null,null,null,null,null,null,null,null,null,null,null,null,null,null,null,null,null,null,null,null,null,null,null,null,null,null,null,null,null,null,null,null,null,null,null,null,null,100,4219,40,113,null,4219,null,37.220363602009435]
[311,100,60,2015,95,30,252,1,null,null,null,null,null,null,null,null,null,null,null,null,null,null,null,null,null,null,null,null,null,null,null,null,null,null,null,null,null,null,null,null,null,null,null,null,null,null,null,null,null,null,null,null,null,null,null,null,null,null,null,null,99.705014749262503,4206.5545722713896,80,113,null,4206.5545722713896,null,74.44072720401887]
[312,98.72727272727272,120,2015,95,50,51,1,null,null,null,null,null,null,null,null,null,null,null,null,null,null,null,null,null,null,null,null,null,null,null,null,null,null,null,null,null,null,null,null,null,null,null,null,null,null,null,null,null,null,null,null,null,null,null,null,null,null,null,null,0,0,0,0,null,999,null,0]
[313,97.27272727272728,160,2015,95,60,51,1,null,null,null,null,null,null,null,null,null,null,null,null,null,null,null,null,null,null,null,null,null,null,null,null,null,null,null,null,null,null,null,null,null,null,null,null,null,null,null,null,null,null,null,null,null,null,null,null,null,null,null,null,0,0,0,0,null,999,null,0]
[314,73.80952380952381,0,2016,96,1,51,0,null,null,null,null,null,null,null,null,null,null,null,null,null,null,null,null,null,null,null,null,null,null,null,null,null,null,null,null,null,null,null,null,null,null,null,null,null,null,null,null,null,null,null,null,null,null,null,null,null,null,null,null,0,0,0,0,null,999,null,0]
[315,87.857142857142861,40,2016,96,14,51,0,null,null,null,null,null,null,null,null,null,null,null,null,null,null,null,null,null,null,null,null,null,null,null,null,null,null,null,null,null,null,null,null,null,null,null,null,null,null,null,null,null,null,null,null,null,null,null,null,null,null,null,null,0,0,0,0,null,999,null,0]
[316,91.904761904761912,80,2016,96,31,247,0,null,null,null,null,null,null,null,null,null,null,null,null,null,null,null,null,null,null,null,null,null,null,null,null,null,null,null,null,null,null,null,null,null,null,null,null,null,null,null,null,null,null,null,null,null,null,null,null,null,null,null,null,0,0,0,0,null,999,null,0]
[317,99.880952380952394,120,2016,96,41,247,0,null,null,null,null,null,null,null,null,null,null,null,null,null,null,null,null,null,null,null,null,null,null,null,null,null,null,null,null,null,null,null,null,null,null,null,null,null,null,null,null,null,null,null,null,null,null,null,null,null,null,null,null,0,0,0,0,null,999,null,0]
[318,100,160,2016,96,52,247,0,null,null,null,null,null,null,null,null,null,null,null,null,null,null,null,null,null,null,null,null,null,null,null,null,null,null,null,null,null,null,null,null,null,null,null,null,null,null,null,null,null,null,null,null,null,null,null,null,null,null,null,null,0,0,0,0,null,999,null,0]
[319,58.591549295774648,0,2016,98,2,247,0,null,null,null,null,null,null,null,null,null,null,null,null,null,null,null,null,null,null,null,null,null,null,null,null,null,null,null,null,null,null,null,null,null,null,null,null,null,null,null,null,null,null,null,null,null,null,null,null,null,null,null,null,0,0,0,0,null,999,null,0]
[320,86.478873239436609,60,2016,98,23,57,0,null,null,null,null,null,null,null,null,null,null,null,null,null,null,null,null,null,null,null,null,null,null,null,null,null,null,null,null,null,null,null,null,null,null,null,null,null,null,null,null,null,null,null,null,null,null,null,null,null,null,null,null,99.072642967542507,4179.8748068006198,0,104,null,4179.8748068006198,null,0]
[321,87.605633802816911,120,2016,98,42,65,0,null,null,null,null,null,null,null,null,null,null,null,null,null,null,null,null,null,null,null,null,null,null,null,null,null,null,null,null,null,null,null,null,null,null,null,null,null,null,null,null,null,null,null,null,null,null,null,null,null,null,null,null,100,4219,60,104,null,4219,null,55.830545403014149]
[322,100,180,2016,98,62,80,0,null,null,null,null,null,null,null,null,null,null,null,null,null,null,null,null,null,null,null,null,null,null,null,null,null,null,null,null,null,null,null,null,null,null,null,null,null,null,null,null,null,null,null,null,null,null,null,null,null,null,null,null,95.672333848531693,4036.4157650695502,120,104,null,4036.4157650695502,null,111.6610908060283]
[323,89.172932330827052,0,2016,99,3,91,0,null,null,null,null,null,null,null,null,null,null,null,null,null,null,null,null,null,null,null,null,null,null,null,null,null,null,null,null,null,null,null,null,null,null,null,null,null,null,null,null,null,null,null,null,null,null,null,null,null,null,null,null,0,0,0,0,null,999,null,0]
[324,89.473684210526315,40,2016,99,15,106,0,null,null,null,null,null,null,null,null,null,null,null,null,null,null,null,null,null,null,null,null,null,null,null,null,null,null,null,null,null,null,null,null,null,null,null,null,null,null,null,null,null,null,null,null,null,null,null,null,null,null,null,null,0,0,0,0,null,999,null,0]
[325,97.593984962406026,80,2016,99,32,46,0,null,null,null,null,null,null,null,null,null,null,null,null,null,null,null,null,null,null,null,null,null,null,null,null,null,null,null,null,null,null,null,null,null,null,null,null,null,null,null,null,null,null,null,null,null,null,null,null,null,null,null,null,0,0,0,0,null,999,null,0]
[326,97.89473684210526,120,2016,99,43,46,0,null,null,null,null,null,null,null,null,null,null,null,null,null,null,null,null,null,null,null,null,null,null,null,null,null,null,null,null,null,null,null,null,null,null,null,null,null,null,null,null,null,null,null,null,null,null,null,null,null,null,null,null,0,0,0,0,null,999,null,0]
[327,100,160,2016,99,53,46,0,null,null,null,null,null,null,null,null,null,null,null,null,null,null,null,null,null,null,null,null,null,null,null,null,null,null,null,null,null,null,null,null,null,null,null,null,null,null,null,null,null,null,null,null,null,null,null,null,null,null,null,null,0,0,0,0,null,999,null,0]
[328,97.022767075306476,0,2017,100,1,46,1,null,null,null,null,null,null,null,null,null,null,null,null,null,null,null,null,null,null,null,null,null,null,null,null,null,null,null,null,null,null,null,null,null,null,null,null,null,null,null,null,null,null,null,null,null,null,null,null,null,null,null,null,0,0,0,0,null,999,null,0]
[329,100,60,2017,100,23,46,1,null,null,null,null,null,null,null,null,null,null,null,null,null,null,null,null,null,null,null,null,null,null,null,null,null,null,null,null,null,null,null,null,null,null,null,null,null,null,null,null,null,null,null,null,null,null,null,null,null,null,null,null,96.264855687606101,4061.4142614601001,120,105,null,4061.4142614601001,null,111.6610908060283]
[330,100,120,2017,100,41,46,1,null,null,null,null,null,null,null,null,null,null,null,null,null,null,null,null,null,null,null,null,null,null,null,null,null,null,null,null,null,null,null,null,null,null,null,null,null,null,null,null,null,null,null,null,null,null,null,null,null,null,null,null,100,4219,160,123,null,4219,null,148.88145440803774]
[331,87.408312958435204,0,2017,102,2,46,0,null,null,null,null,null,null,null,null,null,null,null,null,null,null,null,null,null,null,null,null,null,null,null,null,null,null,null,null,null,null,null,null,null,null,null,null,null,null,null,null,null,null,null,null,null,null,null,null,null,null,null,null,0,0,0,0,null,999,null,0]
[332,97.310513447432754,40,2017,102,14,46,0,null,null,null,null,null,null,null,null,null,null,null,null,null,null,null,null,null,null,null,null,null,null,null,null,null,null,null,null,null,null,null,null,null,null,null,null,null,null,null,null,null,null,null,null,null,null,null,null,null,null,null,null,0,0,0,0,null,999,null,0]
[333,95.965770171149146,80,2017,102,31,46,0,null,null,null,null,null,null,null,null,null,null,null,null,null,null,null,null,null,null,null,null,null,null,null,null,null,null,null,null,null,null,null,null,null,null,null,null,null,null,null,null,null,null,null,null,null,null,null,null,null,null,null,null,0,0,0,0,null,999,null,0]
[334,98.899755501222515,120,2017,102,42,185,0,null,null,null,null,null,null,null,null,null,null,null,null,null,null,null,null,null,null,null,null,null,null,null,null,null,null,null,null,null,null,null,null,null,null,null,null,null,null,null,null,null,null,null,null,null,null,null,null,null,null,null,null,96.758508914100503,4082.2414910859002,120,105,null,4082.2414910859002,null,111.6610908060283]
[335,100,160,2017,102,52,185,0,null,null,null,null,null,null,null,null,null,null,null,null,null,null,null,null,null,null,null,null,null,null,null,null,null,null,null,null,null,null,null,null,null,null,null,null,null,null,null,null,null,null,null,null,null,null,null,null,null,null,null,null,100,4219,160,115,null,4219,null,148.88145440803774]
[336,63.352272727272727,0,2017,104,3,185,0,null,null,null,null,null,null,null,null,null,null,null,null,null,null,null,null,null,null,null,null,null,null,null,null,null,null,null,null,null,null,null,null,null,null,null,null,null,null,null,null,null,null,null,null,null,null,null,null,null,null,null,null,0,0,0,0,null,999,null,0]
[337,85.22727272727272,60,2017,104,24,77,0,null,null,null,null,null,null,null,null,null,null,null,null,null,null,null,null,null,null,null,null,null,null,null,null,null,null,null,null,null,null,null,null,null,null,null,null,null,null,null,null,null,null,null,null,null,null,null,null,null,null,null,null,0,0,0,0,null,999,null,0]
[338,88.210227272727266,120,2017,104,43,77,0,null,null,null,null,null,null,null,null,null,null,null,null,null,null,null,null,null,null,null,null,null,null,null,null,null,null,null,null,null,null,null,null,null,null,null,null,null,null,null,null,null,null,null,null,null,null,null,null,null,null,null,null,0,0,0,0,null,999,null,0]
[339,100,180,2017,104,62,87,0,null,null,null,null,null,null,null,null,null,null,null,null,null,null,null,null,null,null,null,null,null,null,null,null,null,null,null,null,null,null,null,null,null,null,null,null,null,null,null,null,null,null,null,null,null,null,null,null,null,null,null,null,0,0,0,0,null,999,null,0]
[340,89.487870619946094,0,2017,105,4,106,0,null,null,null,null,null,null,null,null,null,null,null,null,null,null,null,null,null,null,null,null,null,null,null,null,null,null,null,null,null,null,null,null,null,null,null,null,null,null,null,null,null,null,null,null,null,null,null,null,null,null,null,null,98.4703632887189,4154.4646271510501,40,109,null,4154.4646271510501,null,37.220363602009435]
[341,96.765498652291086,60,2017,105,25,136,0,null,null,null,null,null,null,null,null,null,null,null,null,null,null,null,null,null,null,null,null,null,null,null,null,null,null,null,null,null,null,null,null,null,null,null,null,null,null,null,null,null,null,null,null,null,null,null,null,null,null,null,null,100,4219,80,115,null,4219,null,74.44072720401887]
[342,98.921832884097043,120,2017,105,44,51,0,null,null,null,null,null,null,null,null,null,null,null,null,null,null,null,null,null,null,null,null,null,null,null,null,null,null,null,null,null,null,null,null,null,null,null,null,null,null,null,null,null,null,null,null,null,null,null,null,null,null,null,null,0,0,0,0,null,999,null,0]
[343,100,180,2017,105,63,51,0,null,null,null,null,null,null,null,null,null,null,null,null,null,null,null,null,null,null,null,null,null,null,null,null,null,null,null,null,null,null,null,null,null,null,null,null,null,null,null,null,null,null,null,null,null,null,null,null,null,null,null,null,0,0,0,0,null,999,null,0]
[344,98.303030303030297,0,2018,101,1,51,1,null,null,null,null,null,null,null,null,null,null,null,null,null,null,null,null,null,null,null,null,null,null,null,null,null,null,null,null,null,null,null,null,null,null,null,null,null,null,null,null,null,null,null,null,null,null,null,null,null,null,null,null,0,0,0,0,null,999,null,0]
[345,99.27272727272728,60,2018,101,23,51,1,null,null,null,null,null,null,null,null,null,null,null,null,null,null,null,null,null,null,null,null,null,null,null,null,null,null,null,null,null,null,null,null,null,null,null,null,null,null,null,null,null,null,null,null,null,null,null,null,null,null,null,null,0,0,0,0,null,999,null,0]
[346,100,120,2018,101,41,63,1,null,null,null,null,null,null,null,null,null,null,null,null,null,null,null,null,null,null,null,null,null,null,null,null,null,null,null,null,null,null,null,null,null,null,null,null,null,null,null,null,null,null,null,null,null,null,null,null,null,null,null,null,0,0,0,0,null,999,null,0]
[347,81.699346405228752,0,2018,103,2,63,0,null,null,null,null,null,null,null,null,null,null,null,null,null,null,null,null,null,null,null,null,null,null,null,null,null,null,null,null,null,null,null,null,null,null,null,null,null,null,null,null,null,null,null,null,null,null,null,null,null,null,null,null,0,0,0,0,null,999,null,0]
[348,85.403050108932462,40,2018,103,14,63,0,null,null,null,null,null,null,null,null,null,null,null,null,null,null,null,null,null,null,null,null,null,null,null,null,null,null,null,null,null,null,null,null,null,null,null,null,null,null,null,null,null,null,null,null,null,null,null,null,null,null,null,null,0,0,0,0,null,999,null,0]
[349,93.246187363834423,80,2018,103,31,63,0,null,null,null,null,null,null,null,null,null,null,null,null,null,null,null,null,null,null,null,null,null,null,null,null,null,null,null,null,null,null,null,null,null,null,null,null,null,null,null,null,null,null,null,null,null,null,null,null,null,null,null,null,0,0,0,0,null,999,null,0]
[350,100,120,2018,103,42,241,0,null,null,null,null,null,null,null,null,null,null,null,null,null,null,null,null,null,null,null,null,null,null,null,null,null,null,null,null,null,null,null,null,null,null,null,null,null,null,null,null,null,null,null,null,null,null,null,null,null,null,null,null,98.275862068965495,4146.2586206896503,40,113,null,4146.2586206896503,null,37.220363602009435]
[351,100,160,2018,103,52,241,0,null,null,null,null,null,null,null,null,null,null,null,null,null,null,null,null,null,null,null,null,null,null,null,null,null,null,null,null,null,null,null,null,null,null,null,null,null,null,null,null,null,null,null,null,null,null,null,null,null,null,null,null,100,4219,80,120,null,4219,null,74.44072720401887]
[352,80.952380952380949,0,2018,106,3,241,0,null,null,null,null,null,null,null,null,null,null,null,null,null,null,null,null,null,null,null,null,null,null,null,null,null,null,null,null,null,null,null,null,null,null,null,null,null,null,null,null,null,null,null,null,null,null,null,null,null,null,null,null,0,0,0,0,null,999,null,0]
[353,95.238095238095227,60,2018,106,24,95,0,null,null,null,null,null,null,null,null,null,null,null,null,null,null,null,null,null,null,null,null,null,null,null,null,null,null,null,null,null,null,null,null,null,null,null,null,null,null,null,null,null,null,null,null,null,null,null,null,null,null,null,null,0,0,0,0,null,999,null,0]
[354,97.802197802197796,120,2018,106,43,106,0,null,null,null,null,null,null,null,null,null,null,null,null,null,null,null,null,null,null,null,null,null,null,null,null,null,null,null,null,null,null,null,null,null,null,null,null,null,null,null,null,null,null,null,null,null,null,null,null,null,null,null,null,0,0,0,0,null,999,null,0]
[355,100,180,2018,106,62,123,0,null,null,null,null,null,null,null,null,null,null,null,null,null,null,null,null,null,null,null,null,null,null,null,null,null,null,null,null,null,null,null,null,null,null,null,null,null,null,null,null,null,null,null,null,null,null,null,null,null,null,null,null,98.412698412698404,4152.0317460317501,40,105,null,4152.0317460317501,null,37.220363602009435]
[356,85.294117647058826,0,2018,107,4,138,0,null,null,null,null,null,null,null,null,null,null,null,null,null,null,null,null,null,null,null,null,null,null,null,null,null,null,null,null,null,null,null,null,null,null,null,null,null,null,null,null,null,null,null,null,null,null,null,null,null,null,null,null,0,0,0,0,null,999,null,0]
[357,95.855614973262036,60,2018,107,25,175,0,null,null,null,null,null,null,null,null,null,null,null,null,null,null,null,null,null,null,null,null,null,null,null,null,null,null,null,null,null,null,null,null,null,null,null,null,null,null,null,null,null,null,null,null,null,null,null,null,null,null,null,null,0,0,0,0,null,999,null,0]
[358,98.796791443850267,120,2018,107,44,69,0,null,null,null,null,null,null,null,null,null,null,null,null,null,null,null,null,null,null,null,null,null,null,null,null,null,null,null,null,null,null,null,null,null,null,null,null,null,null,null,null,null,null,null,null,null,null,null,null,null,null,null,null,0,0,0,0,null,999,null,0]
[359,100,180,2018,107,63,69,0,null,null,null,null,null,null,null,null,null,null,null,null,null,null,null,null,null,null,null,null,null,null,null,null,null,null,null,null,null,null,null,null,null,null,null,null,null,null,null,null,null,null,null,null,null,null,null,null,null,null,null,null,0,0,0,0,null,999,null,0]
[360,67.887931034482762,0,2018,108,5,69,0,null,null,null,null,null,null,null,null,null,null,null,null,null,null,null,null,null,null,null,null,null,null,null,null,null,null,null,null,null,null,null,null,null,null,null,null,null,null,null,null,null,null,null,null,null,null,null,null,null,null,null,null,0,0,0,0,null,999,null,0]
[361,84.698275862068968,40,2018,108,15,69,0,null,null,null,null,null,null,null,null,null,null,null,null,null,null,null,null,null,null,null,null,null,null,null,null,null,null,null,null,null,null,null,null,null,null,null,null,null,null,null,null,null,null,null,null,null,null,null,null,null,null,null,null,0,0,0,0,null,999,null,0]
[362,92.995689655172413,80,2018,108,32,66,0,null,null,null,null,null,null,null,null,null,null,null,null,null,null,null,null,null,null,null,null,null,null,null,null,null,null,null,null,null,null,null,null,null,null,null,null,null,null,null,null,null,null,null,null,null,null,null,null,null,null,null,null,0,0,0,0,null,999,null,0]
[363,100,120,2018,108,45,66,0,null,null,null,null,null,null,null,null,null,null,null,null,null,null,null,null,null,null,null,null,null,null,null,null,null,null,null,null,null,null,null,null,null,null,null,null,null,null,null,null,null,null,null,null,null,null,null,null,null,null,null,null,0,0,0,0,null,999,null,0]
[364,98.383620689655174,160,2018,108,53,66,0,null,null,null,null,null,null,null,null,null,null,null,null,null,null,null,null,null,null,null,null,null,null,null,null,null,null,null,null,null,null,null,null,null,null,null,null,null,null,null,null,null,null,null,null,null,null,null,null,null,null,null,null,0,0,0,0,null,999,null,0]
[365,60.75949367088608,0,2019,109,1,66,0,null,null,null,null,null,null,null,null,null,null,null,null,null,null,null,null,null,null,null,null,null,null,null,null,null,null,null,null,null,null,null,null,null,null,null,null,null,null,null,null,null,null,null,null,null,null,null,null,null,null,null,null,0,0,0,0,null,999,null,0]
[366,84.050632911392412,40,2019,109,14,52,0,null,null,null,null,null,null,null,null,null,null,null,null,null,null,null,null,null,null,null,null,null,null,null,null,null,null,null,null,null,null,null,null,null,null,null,null,null,null,null,null,null,null,null,null,null,null,null,null,null,null,null,null,0,0,0,0,null,999,null,0]
[367,94.303797468354432,80,2019,109,31,65,0,null,null,null,null,null,null,null,null,null,null,null,null,null,null,null,null,null,null,null,null,null,null,null,null,null,null,null,null,null,null,null,null,null,null,null,null,null,null,null,null,null,null,null,null,null,null,null,null,null,null,null,null,{"$f":"_xlfn.NUMBERVALUE(IF(AND($G195>=($U$151-$Y$151),$G195<=($U$151+$Y$151)),B195,\"\"))","v":0},{"$f":"_xlfn.NUMBERVALUE(IFERROR(+BI368*$W$149,\"\"))","v":0},{"$f":"_xlfn.NUMBERVALUE(IF(AND($G195>=($U$151-$Y$151),$G195<=($U$151+$Y$151)),C195,\"\"))","v":0},{"$f":"_xlfn.NUMBERVALUE(IF(AND($G195>=($U$151-$Y$151),$G195<=($U$151+$Y$151)),G195,\"\"))","v":0},null,{"$f":"IF(BJ368=0,999,BJ368)","v":999},null,{"$f":"+BK368*$BP$172","v":0}]
[368,96.455696202531655,120,2019,109,41,74,0,null,null,null,null,null,null,null,null,null,null,null,null,null,null,null,null,null,null,null,null,null,null,null,null,null,null,null,null,null,null,null,null,null,null,null,null,null,null,null,null,null,null,null,null,null,null,null,null,null,null,null,null,0,0,0,0,null,999,null,0]
[369,100,160,2019,109,52,85,0,null,null,null,null,null,null,null,null,null,null,null,null,null,null,null,null,null,null,null,null,null,null,null,null,null,null,null,null,null,null,null,null,null,null,null,null,null,null,null,null,null,null,null,null,null,null,null,null,null,null,null,null,0,0,0,0,null,999,null,0]
[370,82.575024201355276,0,2019,110,2,105,0,null,null,null,null,null,null,null,null,null,null,null,null,null,null,null,null,null,null,null,null,null,null,null,null,null,null,null,null,null,null,null,null,null,null,null,null,null,null,null,null,null,null,null,null,null,null,null,null,null,null,null,null,0,0,0,0,null,999,null,0]
[371,100,40,2019,110,15,50,0,null,null,null,null,null,null,null,null,null,null,null,null,null,null,null,null,null,null,null,null,null,null,null,null,null,null,null,null,null,null,null,null,null,null,null,null,null,null,null,null,null,null,null,null,null,null,null,null,null,null,null,null,0,0,0,0,null,999,null,0]
[372,97.192642787996135,80,2019,110,32,60,0,null,null,null,null,null,null,null,null,null,null,null,null,null,null,null,null,null,null,null,null,null,null,null,null,null,null,null,null,null,null,null,null,null,null,null,null,null,null,null,null,null,null,null,null,null,null,null,null,null,null,null,null,0,0,0,0,null,999,null,0]
[373,99.51597289448209,120,2019,110,42,71,0,null,null,null,null,null,null,null,null,null,null,null,null,null,null,null,null,null,null,null,null,null,null,null,null,null,null,null,null,null,null,null,null,null,null,null,null,null,null,null,null,null,null,null,null,null,null,null,null,null,null,null,null,0,0,0,0,null,999,null,0]
[374,98.354307841239105,160,2019,110,53,81,0,null,null,null,null,null,null,null,null,null,null,null,null,null,null,null,null,null,null,null,null,null,null,null,null,null,null,null,null,null,null,null,null,null,null,null,null,null,null,null,null,null,null,null,null,null,null,null,null,null,null,null,null,0,0,0,0,null,999,null,0]
[null,null,null,null,null,null,null,null,null,null,null,null,null,null,null,null,null,null,null,null,null,null,null,null,null,null,null,null,null,null,null,null,null,null,null,null,null,null,null,null,null,null,null,null,null,null,null,null,null,null,null,null,null,null,null,null,null,null,null,null,0,0,0,0,null,999,null,0]
[null,null,null,null,null,null,null,null,null,null,null,null,null,null,null,null,null,null,null,null,null,null,null,null,null,null,null,null,null,null,null,null,null,null,null,null,null,null,null,null,null,null,null,null,null,null,null,null,null,null,null,null,null,null,null,null,null,null,null,null,0,0,0,0,null,999,null,0]
[null,null,null,null,null,null,null,null,null,null,null,null,null,null,null,null,null,null,null,null,null,null,null,null,null,null,null,null,null,null,null,null,null,null,null,null,null,null,null,null,null,null,null,null,null,null,null,null,null,null,null,null,null,null,null,null,null,null,null,null,0,0,0,0,null,999,null,0]
[null,null,null,null,null,null,null,null,null,null,null,null,null,null,null,null,null,null,null,null,null,null,null,null,null,null,null,null,null,null,null,null,null,null,null,null,null,null,null,null,null,null,null,null,null,null,null,null,null,null,null,null,null,null,null,null,null,null,null,null,0,0,0,0,null,999,null,0]
[null,null,null,null,null,null,null,null,null,null,null,null,null,null,null,null,null,null,null,null,null,null,null,null,null,null,null,null,null,null,null,null,null,null,null,null,null,null,null,null,null,null,null,null,null,null,null,null,null,null,null,null,null,null,null,null,null,null,null,null,91.279069767441896,3851.0639534883699,60,118,null,3851.0639534883699,null,55.830545403014149]
[null,null,null,null,null,null,null,null,null,null,null,null,null,null,null,null,null,null,null,null,null,null,null,null,null,null,null,null,null,null,null,null,null,null,null,null,null,null,null,null,null,null,null,null,null,null,null,null,null,null,null,null,null,null,null,null,null,null,null,null,0,0,0,0,null,999,null,0]
[null,null,null,null,null,null,null,null,null,null,null,null,null,null,null,null,null,null,null,null,null,null,null,null,null,null,null,null,null,null,null,null,null,null,null,null,null,null,null,null,null,null,null,null,null,null,null,null,null,null,null,null,null,null,null,null,null,null,null,null,0,0,0,0,null,999,null,0]
[null,null,null,null,null,null,null,null,null,null,null,null,null,null,null,null,null,null,null,null,null,null,null,null,null,null,null,null,null,null,null,null,null,null,null,null,null,null,null,null,null,null,null,null,null,null,null,null,null,null,null,null,null,null,null,null,null,null,null,null,0,0,0,0,null,999,null,0]
[null,null,null,null,null,null,null,null,null,null,null,null,null,null,null,null,null,null,null,null,null,null,null,null,null,null,null,null,null,null,null,null,null,null,null,null,null,null,null,null,null,null,null,null,null,null,null,null,null,null,null,null,null,null,null,null,null,null,null,null,0,0,0,0,null,999,null,0]
[null,null,null,null,null,null,null,null,null,null,null,null,null,null,null,null,null,null,null,null,null,null,null,null,null,null,null,null,null,null,null,null,null,null,null,null,null,null,null,null,null,null,null,null,null,null,null,null,null,null,null,null,null,null,null,null,null,null,null,null,0,0,0,0,null,999,null,0]
[null,null,null,null,null,null,null,null,null,null,null,null,null,null,null,null,null,null,null,null,null,null,null,null,null,null,null,null,null,null,null,null,null,null,null,null,null,null,null,null,null,null,null,null,null,null,null,null,null,null,null,null,null,null,null,null,null,null,null,null,0,0,0,0,null,999,null,0]
[null,null,null,null,null,null,null,null,null,null,null,null,null,null,null,null,null,null,null,null,null,null,null,null,null,null,null,null,null,null,null,null,null,null,null,null,null,null,null,null,null,null,null,null,null,null,null,null,null,null,null,null,null,null,null,null,null,null,null,null,0,0,0,0,null,999,null,0]
[null,null,null,null,null,null,null,null,null,null,null,null,null,null,null,null,null,null,null,null,null,null,null,null,null,null,null,null,null,null,null,null,null,null,null,null,null,null,null,null,null,null,null,null,null,null,null,null,null,null,null,null,null,null,null,null,null,null,null,null,0,0,0,0,null,999,null,0]
[null,null,null,null,null,null,null,null,null,null,null,null,null,null,null,null,null,null,null,null,null,null,null,null,null,null,null,null,null,null,null,null,null,null,null,null,null,null,null,null,null,null,null,null,null,null,null,null,null,null,null,null,null,null,null,null,null,null,null,null,0,0,0,0,null,999,null,0]
[null,null,null,null,null,null,null,null,null,null,null,null,null,null,null,null,null,null,null,null,null,null,null,null,null,null,null,null,null,null,null,null,null,null,null,null,null,null,null,null,null,null,null,null,null,null,null,null,null,null,null,null,null,null,null,null,null,null,null,null,0,0,0,0,null,999,null,0]
[null,null,null,null,null,null,null,null,null,null,null,null,null,null,null,null,null,null,null,null,null,null,null,null,null,null,null,null,null,null,null,null,null,null,null,null,null,null,null,null,null,null,null,null,null,null,null,null,null,null,null,null,null,null,null,null,null,null,null,null,0,0,0,0,null,999,null,0]
[null,null,null,null,null,null,null,null,null,null,null,null,null,null,null,null,null,null,null,null,null,null,null,null,null,null,null,null,null,null,null,null,null,null,null,null,null,null,null,null,null,null,null,null,null,null,null,null,null,null,null,null,null,null,null,null,null,null,null,null,0,0,0,0,null,999,null,0]
[null,null,null,null,null,null,null,null,null,null,null,null,null,null,null,null,null,null,null,null,null,null,null,null,null,null,null,null,null,null,null,null,null,null,null,null,null,null,null,null,null,null,null,null,null,null,null,null,null,null,null,null,null,null,null,null,null,null,null,null,0,0,0,0,null,999,null,0]
[null,null,null,null,null,null,null,null,null,null,null,null,null,null,null,null,null,null,null,null,null,null,null,null,null,null,null,null,null,null,null,null,null,null,null,null,null,null,null,null,null,null,null,null,null,null,null,null,null,null,null,null,null,null,null,null,null,null,null,null,0,0,0,0,null,999,null,0]
[null,null,null,null,null,null,null,null,null,null,null,null,null,null,null,null,null,null,null,null,null,null,null,null,null,null,null,null,null,null,null,null,null,null,null,null,null,null,null,null,null,null,null,null,null,null,null,null,null,null,null,null,null,null,null,null,null,null,null,null,0,0,0,0,null,999,null,0]
[null,null,null,null,null,null,null,null,null,null,null,null,null,null,null,null,null,null,null,null,null,null,null,null,null,null,null,null,null,null,null,null,null,null,null,null,null,null,null,null,null,null,null,null,null,null,null,null,null,null,null,null,null,null,null,null,null,null,null,null,0,0,0,0,null,999,null,0]
[null,null,null,null,null,null,null,null,null,null,null,null,null,null,null,null,null,null,null,null,null,null,null,null,null,null,null,null,null,null,null,null,null,null,null,null,null,null,null,null,null,null,null,null,null,null,null,null,null,null,null,null,null,null,null,null,null,null,null,null,0,0,0,0,null,999,null,0]
[null,null,null,null,null,null,null,null,null,null,null,null,null,null,null,null,null,null,null,null,null,null,null,null,null,null,null,null,null,null,null,null,null,null,null,null,null,null,null,null,null,null,null,null,null,null,null,null,null,null,null,null,null,null,null,null,null,null,null,null,0,0,0,0,null,999,null,0]
[null,null,null,null,null,null,null,null,null,null,null,null,null,null,null,null,null,null,null,null,null,null,null,null,null,null,null,null,null,null,null,null,null,null,null,null,null,null,null,null,null,null,null,null,null,null,null,null,null,null,null,null,null,null,null,null,null,null,null,null,0,0,0,0,null,999,null,0]
[null,null,null,null,null,null,null,null,null,null,null,null,null,null,null,null,null,null,null,null,null,null,null,null,null,null,null,null,null,null,null,null,null,null,null,null,null,null,null,null,null,null,null,null,null,null,null,null,null,null,null,null,null,null,null,null,null,null,null,null,0,0,0,0,null,999,null,0]
[null,null,null,null,null,null,null,null,null,null,null,null,null,null,null,null,null,null,null,null,null,null,null,null,null,null,null,null,null,null,null,null,null,null,null,null,null,null,null,null,null,null,null,null,null,null,null,null,null,null,null,null,null,null,null,null,null,null,null,null,0,0,0,0,null,999,null,0]
[null,null,null,null,null,null,null,null,null,null,null,null,null,null,null,null,null,null,null,null,null,null,null,null,null,null,null,null,null,null,null,null,null,null,null,null,null,null,null,null,null,null,null,null,null,null,null,null,null,null,null,null,null,null,null,null,null,null,null,null,0,0,0,0,null,999,null,0]
[null,null,null,null,null,null,null,null,null,null,null,null,null,null,null,null,null,null,null,null,null,null,null,null,null,null,null,null,null,null,null,null,null,null,null,null,null,null,null,null,null,null,null,null,null,null,null,null,null,null,null,null,null,null,null,null,null,null,null,null,0,0,0,0,null,999,null,0]
[null,null,null,null,null,null,null,null,null,null,null,null,null,null,null,null,null,null,null,null,null,null,null,null,null,null,null,null,null,null,null,null,null,null,null,null,null,null,null,null,null,null,null,null,null,null,null,null,null,null,null,null,null,null,null,null,null,null,null,null,0,0,0,0,null,999,null,0]
[null,null,null,null,null,null,null,null,null,null,null,null,null,null,null,null,null,null,null,null,null,null,null,null,null,null,null,null,null,null,null,null,null,null,null,null,null,null,null,null,null,null,null,null,null,null,null,null,null,null,null,null,null,null,null,null,null,null,null,null,0,0,0,0,null,999,null,0]
[null,null,null,null,null,null,null,null,null,null,null,null,null,null,null,null,null,null,null,null,null,null,null,null,null,null,null,null,null,null,null,null,null,null,null,null,null,null,null,null,null,null,null,null,null,null,null,null,null,null,null,null,null,null,null,null,null,null,null,null,0,0,0,0,null,999,null,0]
[null,null,null,null,null,null,null,null,null,null,null,null,null,null,null,null,null,null,null,null,null,null,null,null,null,null,null,null,null,null,null,null,null,null,null,null,null,null,null,null,null,null,null,null,null,null,null,null,null,null,null,null,null,null,null,null,null,null,null,null,0,0,0,0,null,999,null,0]
[null,null,null,null,null,null,null,null,null,null,null,null,null,null,null,null,null,null,null,null,null,null,null,null,null,null,null,null,null,null,null,null,null,null,null,null,null,null,null,null,null,null,null,null,null,null,null,null,null,null,null,null,null,null,null,null,null,null,null,null,0,0,0,0,null,999,null,0]
[null,null,null,null,null,null,null,null,null,null,null,null,null,null,null,null,null,null,null,null,null,null,null,null,null,null,null,null,null,null,null,null,null,null,null,null,null,null,null,null,null,null,null,null,null,null,null,null,null,null,null,null,null,null,null,null,null,null,null,null,0,0,0,0,null,999,null,0]
[null,null,null,null,null,null,null,null,null,null,null,null,null,null,null,null,null,null,null,null,null,null,null,null,null,null,null,null,null,null,null,null,null,null,null,null,null,null,null,null,null,null,null,null,null,null,null,null,null,null,null,null,null,null,null,null,null,null,null,null,0,0,0,0,null,999,null,0]
[null,null,null,null,null,null,null,null,null,null,null,null,null,null,null,null,null,null,null,null,null,null,null,null,null,null,null,null,null,null,null,null,null,null,null,null,null,null,null,null,null,null,null,null,null,null,null,null,null,null,null,null,null,null,null,null,null,null,null,null,0,0,0,0,null,999,null,0]
[null,null,null,null,null,null,null,null,null,null,null,null,null,null,null,null,null,null,null,null,null,null,null,null,null,null,null,null,null,null,null,null,null,null,null,null,null,null,null,null,null,null,null,null,null,null,null,null,null,null,null,null,null,null,null,null,null,null,null,null,0,0,0,0,null,999,null,0]
[null,null,null,null,null,null,null,null,null,null,null,null,null,null,null,null,null,null,null,null,null,null,null,null,null,null,null,null,null,null,null,null,null,null,null,null,null,null,null,null,null,null,null,null,null,null,null,null,null,null,null,null,null,null,null,null,null,null,null,null,0,0,0,0,null,999,null,0]
[null,null,null,null,null,null,null,null,null,null,null,null,null,null,null,null,null,null,null,null,null,null,null,null,null,null,null,null,null,null,null,null,null,null,null,null,null,null,null,null,null,null,null,null,null,null,null,null,null,null,null,null,null,null,null,null,null,null,null,null,0,0,0,0,null,999,null,0]
[null,null,null,null,null,null,null,null,null,null,null,null,null,null,null,null,null,null,null,null,null,null,null,null,null,null,null,null,null,null,null,null,null,null,null,null,null,null,null,null,null,null,null,null,null,null,null,null,null,null,null,null,null,null,null,null,null,null,null,null,0,0,0,0,null,999,null,0]
[null,null,null,null,null,null,null,null,null,null,null,null,null,null,null,null,null,null,null,null,null,null,null,null,null,null,null,null,null,null,null,null,null,null,null,null,null,null,null,null,null,null,null,null,null,null,null,null,null,null,null,null,null,null,null,null,null,null,null,null,0,0,0,0,null,999,null,0]
[null,null,null,null,null,null,null,null,null,null,null,null,null,null,null,null,null,null,null,null,null,null,null,null,null,null,null,null,null,null,null,null,null,null,null,null,null,null,null,null,null,null,null,null,null,null,null,null,null,null,null,null,null,null,null,null,null,null,null,null,0,0,0,0,null,999,null,0]
[null,null,null,null,null,null,null,null,null,null,null,null,null,null,null,null,null,null,null,null,null,null,null,null,null,null,null,null,null,null,null,null,null,null,null,null,null,null,null,null,null,null,null,null,null,null,null,null,null,null,null,null,null,null,null,null,null,null,null,null,0,0,0,0,null,999,null,0]
[null,null,null,null,null,null,null,null,null,null,null,null,null,null,null,null,null,null,null,null,null,null,null,null,null,null,null,null,null,null,null,null,null,null,null,null,null,null,null,null,null,null,null,null,null,null,null,null,null,null,null,null,null,null,null,null,null,null,null,null,0,0,0,0,null,999,null,0]
[null,null,null,null,null,null,null,null,null,null,null,null,null,null,null,null,null,null,null,null,null,null,null,null,null,null,null,null,null,null,null,null,null,null,null,null,null,null,null,null,null,null,null,null,null,null,null,null,null,null,null,null,null,null,null,null,null,null,null,null,0,0,0,0,null,999,null,0]
[null,null,null,null,null,null,null,null,null,null,null,null,null,null,null,null,null,null,null,null,null,null,null,null,null,null,null,null,null,null,null,null,null,null,null,null,null,null,null,null,null,null,null,null,null,null,null,null,null,null,null,null,null,null,null,null,null,null,null,null,0,0,0,0,null,999,null,0]
[null,null,null,null,null,null,null,null,null,null,null,null,null,null,null,null,null,null,null,null,null,null,null,null,null,null,null,null,null,null,null,null,null,null,null,null,null,null,null,null,null,null,null,null,null,null,null,null,null,null,null,null,null,null,null,null,null,null,null,null,0,0,0,0,null,999,null,0]
[null,null,null,null,null,null,null,null,null,null,null,null,null,null,null,null,null,null,null,null,null,null,null,null,null,null,null,null,null,null,null,null,null,null,null,null,null,null,null,null,null,null,null,null,null,null,null,null,null,null,null,null,null,null,null,null,null,null,null,null,0,0,0,0,null,999,null,0]
[null,null,null,null,null,null,null,null,null,null,null,null,null,null,null,null,null,null,null,null,null,null,null,null,null,null,null,null,null,null,null,null,null,null,null,null,null,null,null,null,null,null,null,null,null,null,null,null,null,null,null,null,null,null,null,null,null,null,null,null,0,0,0,0,null,999,null,0]
[null,null,null,null,null,null,null,null,null,null,null,null,null,null,null,null,null,null,null,null,null,null,null,null,null,null,null,null,null,null,null,null,null,null,null,null,null,null,null,null,null,null,null,null,null,null,null,null,null,null,null,null,null,null,null,null,null,null,null,null,0,0,0,0,null,999,null,0]
[null,null,null,null,null,null,null,null,null,null,null,null,null,null,null,null,null,null,null,null,null,null,null,null,null,null,null,null,null,null,null,null,null,null,null,null,null,null,null,null,null,null,null,null,null,null,null,null,null,null,null,null,null,null,null,null,null,null,null,null,0,0,0,0,null,999,null,0]
[null,null,null,null,null,null,null,null,null,null,null,null,null,null,null,null,null,null,null,null,null,null,null,null,null,null,null,null,null,null,null,null,null,null,null,null,null,null,null,null,null,null,null,null,null,null,null,null,null,null,null,null,null,null,null,null,null,null,null,null,0,0,0,0,null,999,null,0]
[null,null,null,null,null,null,null,null,null,null,null,null,null,null,null,null,null,null,null,null,null,null,null,null,null,null,null,null,null,null,null,null,null,null,null,null,null,null,null,null,null,null,null,null,null,null,null,null,null,null,null,null,null,null,null,null,null,null,null,null,0,0,0,0,null,999,null,0]
[null,null,null,null,null,null,null,null,null,null,null,null,null,null,null,null,null,null,null,null,null,null,null,null,null,null,null,null,null,null,null,null,null,null,null,null,null,null,null,null,null,null,null,null,null,null,null,null,null,null,null,null,null,null,null,null,null,null,null,null,0,0,0,0,null,999,null,0]
[null,null,null,null,null,null,null,null,null,null,null,null,null,null,null,null,null,null,null,null,null,null,null,null,null,null,null,null,null,null,null,null,null,null,null,null,null,null,null,null,null,null,null,null,null,null,null,null,null,null,null,null,null,null,null,null,null,null,null,null,0,0,0,0,null,999,null,0]
[null,null,null,null,null,null,null,null,null,null,null,null,null,null,null,null,null,null,null,null,null,null,null,null,null,null,null,null,null,null,null,null,null,null,null,null,null,null,null,null,null,null,null,null,null,null,null,null,null,null,null,null,null,null,null,null,null,null,null,null,0,0,0,0,null,999,null,0]
[null,null,null,null,null,null,null,null,null,null,null,null,null,null,null,null,null,null,null,null,null,null,null,null,null,null,null,null,null,null,null,null,null,null,null,null,null,null,null,null,null,null,null,null,null,null,null,null,null,null,null,null,null,null,null,null,null,null,null,null,{"$f":"_xlfn.NUMBERVALUE(IF(AND($G259>=($U$151-$Y$151),$G259<=($U$151+$Y$151)),B259,\"\"))","v":0},{"$f":"_xlfn.NUMBERVALUE(IFERROR(+BI432*$W$149,\"\"))","v":0},{"$f":"_xlfn.NUMBERVALUE(IF(AND($G259>=($U$151-$Y$151),$G259<=($U$151+$Y$151)),C259,\"\"))","v":0},{"$f":"_xlfn.NUMBERVALUE(IF(AND($G259>=($U$151-$Y$151),$G259<=($U$151+$Y$151)),G259,\"\"))","v":0},null,{"$f":"IF(BJ432=0,999,BJ432)","v":999},null,{"$f":"+BK432*$BP$172","v":0}]
[null,null,null,null,null,null,null,null,null,null,null,null,null,null,null,null,null,null,null,null,null,null,null,null,null,null,null,null,null,null,null,null,null,null,null,null,null,null,null,null,null,null,null,null,null,null,null,null,null,null,null,null,null,null,null,null,null,null,null,null,0,0,0,0,null,999,null,0]
[null,null,null,null,null,null,null,null,null,null,null,null,null,null,null,null,null,null,null,null,null,null,null,null,null,null,null,null,null,null,null,null,null,null,null,null,null,null,null,null,null,null,null,null,null,null,null,null,null,null,null,null,null,null,null,null,null,null,null,null,0,0,0,0,null,999,null,0]
[null,null,null,null,null,null,null,null,null,null,null,null,null,null,null,null,null,null,null,null,null,null,null,null,null,null,null,null,null,null,null,null,null,null,null,null,null,null,null,null,null,null,null,null,null,null,null,null,null,null,null,null,null,null,null,null,null,null,null,null,0,0,0,0,null,999,null,0]
[null,null,null,null,null,null,null,null,null,null,null,null,null,null,null,null,null,null,null,null,null,null,null,null,null,null,null,null,null,null,null,null,null,null,null,null,null,null,null,null,null,null,null,null,null,null,null,null,null,null,null,null,null,null,null,null,null,null,null,null,0,0,0,0,null,999,null,0]
[null,null,null,null,null,null,null,null,null,null,null,null,null,null,null,null,null,null,null,null,null,null,null,null,null,null,null,null,null,null,null,null,null,null,null,null,null,null,null,null,null,null,null,null,null,null,null,null,null,null,null,null,null,null,null,null,null,null,null,null,0,0,0,0,null,999,null,0]
[null,null,null,null,null,null,null,null,null,null,null,null,null,null,null,null,null,null,null,null,null,null,null,null,null,null,null,null,null,null,null,null,null,null,null,null,null,null,null,null,null,null,null,null,null,null,null,null,null,null,null,null,null,null,null,null,null,null,null,null,0,0,0,0,null,999,null,0]
[null,null,null,null,null,null,null,null,null,null,null,null,null,null,null,null,null,null,null,null,null,null,null,null,null,null,null,null,null,null,null,null,null,null,null,null,null,null,null,null,null,null,null,null,null,null,null,null,null,null,null,null,null,null,null,null,null,null,null,null,0,0,0,0,null,999,null,0]
[null,null,null,null,null,null,null,null,null,null,null,null,null,null,null,null,null,null,null,null,null,null,null,null,null,null,null,null,null,null,null,null,null,null,null,null,null,null,null,null,null,null,null,null,null,null,null,null,null,null,null,null,null,null,null,null,null,null,null,null,0,0,0,0,null,999,null,0]
[null,null,null,null,null,null,null,null,null,null,null,null,null,null,null,null,null,null,null,null,null,null,null,null,null,null,null,null,null,null,null,null,null,null,null,null,null,null,null,null,null,null,null,null,null,null,null,null,null,null,null,null,null,null,null,null,null,null,null,null,0,0,0,0,null,999,null,0]
[null,null,null,null,null,null,null,null,null,null,null,null,null,null,null,null,null,null,null,null,null,null,null,null,null,null,null,null,null,null,null,null,null,null,null,null,null,null,null,null,null,null,null,null,null,null,null,null,null,null,null,null,null,null,null,null,null,null,null,null,0,0,0,0,null,999,null,0]
[null,null,null,null,null,null,null,null,null,null,null,null,null,null,null,null,null,null,null,null,null,null,null,null,null,null,null,null,null,null,null,null,null,null,null,null,null,null,null,null,null,null,null,null,null,null,null,null,null,null,null,null,null,null,null,null,null,null,null,null,0,0,0,0,null,999,null,0]
[null,null,null,null,null,null,null,null,null,null,null,null,null,null,null,null,null,null,null,null,null,null,null,null,null,null,null,null,null,null,null,null,null,null,null,null,null,null,null,null,null,null,null,null,null,null,null,null,null,null,null,null,null,null,null,null,null,null,null,null,0,0,0,0,null,999,null,0]
[null,null,null,null,null,null,null,null,null,null,null,null,null,null,null,null,null,null,null,null,null,null,null,null,null,null,null,null,null,null,null,null,null,null,null,null,null,null,null,null,null,null,null,null,null,null,null,null,null,null,null,null,null,null,null,null,null,null,null,null,0,0,0,0,null,999,null,0]
[null,null,null,null,null,null,null,null,null,null,null,null,null,null,null,null,null,null,null,null,null,null,null,null,null,null,null,null,null,null,null,null,null,null,null,null,null,null,null,null,null,null,null,null,null,null,null,null,null,null,null,null,null,null,null,null,null,null,null,null,0,0,0,0,null,999,null,0]
[null,null,null,null,null,null,null,null,null,null,null,null,null,null,null,null,null,null,null,null,null,null,null,null,null,null,null,null,null,null,null,null,null,null,null,null,null,null,null,null,null,null,null,null,null,null,null,null,null,null,null,null,null,null,null,null,null,null,null,null,0,0,0,0,null,999,null,0]
[null,null,null,null,null,null,null,null,null,null,null,null,null,null,null,null,null,null,null,null,null,null,null,null,null,null,null,null,null,null,null,null,null,null,null,null,null,null,null,null,null,null,null,null,null,null,null,null,null,null,null,null,null,null,null,null,null,null,null,null,0,0,0,0,null,999,null,0]
[null,null,null,null,null,null,null,null,null,null,null,null,null,null,null,null,null,null,null,null,null,null,null,null,null,null,null,null,null,null,null,null,null,null,null,null,null,null,null,null,null,null,null,null,null,null,null,null,null,null,null,null,null,null,null,null,null,null,null,null,0,0,0,0,null,999,null,0]
[null,null,null,null,null,null,null,null,null,null,null,null,null,null,null,null,null,null,null,null,null,null,null,null,null,null,null,null,null,null,null,null,null,null,null,null,null,null,null,null,null,null,null,null,null,null,null,null,null,null,null,null,null,null,null,null,null,null,null,null,0,0,0,0,null,999,null,0]
[null,null,null,null,null,null,null,null,null,null,null,null,null,null,null,null,null,null,null,null,null,null,null,null,null,null,null,null,null,null,null,null,null,null,null,null,null,null,null,null,null,null,null,null,null,null,null,null,null,null,null,null,null,null,null,null,null,null,null,null,0,0,0,0,null,999,null,0]
[null,null,null,null,null,null,null,null,null,null,null,null,null,null,null,null,null,null,null,null,null,null,null,null,null,null,null,null,null,null,null,null,null,null,null,null,null,null,null,null,null,null,null,null,null,null,null,null,null,null,null,null,null,null,null,null,null,null,null,null,0,0,0,0,null,999,null,0]
[null,null,null,null,null,null,null,null,null,null,null,null,null,null,null,null,null,null,null,null,null,null,null,null,null,null,null,null,null,null,null,null,null,null,null,null,null,null,null,null,null,null,null,null,null,null,null,null,null,null,null,null,null,null,null,null,null,null,null,null,0,0,0,0,null,999,null,0]
[null,null,null,null,null,null,null,null,null,null,null,null,null,null,null,null,null,null,null,null,null,null,null,null,null,null,null,null,null,null,null,null,null,null,null,null,null,null,null,null,null,null,null,null,null,null,null,null,null,null,null,null,null,null,null,null,null,null,null,null,0,0,0,0,null,999,null,0]
[null,null,null,null,null,null,null,null,null,null,null,null,null,null,null,null,null,null,null,null,null,null,null,null,null,null,null,null,null,null,null,null,null,null,null,null,null,null,null,null,null,null,null,null,null,null,null,null,null,null,null,null,null,null,null,null,null,null,null,null,0,0,0,0,null,999,null,0]
[null,null,null,null,null,null,null,null,null,null,null,null,null,null,null,null,null,null,null,null,null,null,null,null,null,null,null,null,null,null,null,null,null,null,null,null,null,null,null,null,null,null,null,null,null,null,null,null,null,null,null,null,null,null,null,null,null,null,null,null,0,0,0,0,null,999,null,0]
[null,null,null,null,null,null,null,null,null,null,null,null,null,null,null,null,null,null,null,null,null,null,null,null,null,null,null,null,null,null,null,null,null,null,null,null,null,null,null,null,null,null,null,null,null,null,null,null,null,null,null,null,null,null,null,null,null,null,null,null,0,0,0,0,null,999,null,0]
[null,null,null,null,null,null,null,null,null,null,null,null,null,null,null,null,null,null,null,null,null,null,null,null,null,null,null,null,null,null,null,null,null,null,null,null,null,null,null,null,null,null,null,null,null,null,null,null,null,null,null,null,null,null,null,null,null,null,null,null,0,0,0,0,null,999,null,0]
[null,null,null,null,null,null,null,null,null,null,null,null,null,null,null,null,null,null,null,null,null,null,null,null,null,null,null,null,null,null,null,null,null,null,null,null,null,null,null,null,null,null,null,null,null,null,null,null,null,null,null,null,null,null,null,null,null,null,null,null,0,0,0,0,null,999,null,0]
[null,null,null,null,null,null,null,null,null,null,null,null,null,null,null,null,null,null,null,null,null,null,null,null,null,null,null,null,null,null,null,null,null,null,null,null,null,null,null,null,null,null,null,null,null,null,null,null,null,null,null,null,null,null,null,null,null,null,null,null,88.768115942028999,3745.1268115941998,0,117,null,3745.1268115941998,null,0]
[null,null,null,null,null,null,null,null,null,null,null,null,null,null,null,null,null,null,null,null,null,null,null,null,null,null,null,null,null,null,null,null,null,null,null,null,null,null,null,null,null,null,null,null,null,null,null,null,null,null,null,null,null,null,null,null,null,null,null,null,0,0,0,0,null,999,null,0]
[null,null,null,null,null,null,null,null,null,null,null,null,null,null,null,null,null,null,null,null,null,null,null,null,null,null,null,null,null,null,null,null,null,null,null,null,null,null,null,null,null,null,null,null,null,null,null,null,null,null,null,null,null,null,null,null,null,null,null,null,0,0,0,0,null,999,null,0]
[null,null,null,null,null,null,null,null,null,null,null,null,null,null,null,null,null,null,null,null,null,null,null,null,null,null,null,null,null,null,null,null,null,null,null,null,null,null,null,null,null,null,null,null,null,null,null,null,null,null,null,null,null,null,null,null,null,null,null,null,0,0,0,0,null,999,null,0]
[null,null,null,null,null,null,null,null,null,null,null,null,null,null,null,null,null,null,null,null,null,null,null,null,null,null,null,null,null,null,null,null,null,null,null,null,null,null,null,null,null,null,null,null,null,null,null,null,null,null,null,null,null,null,null,null,null,null,null,null,0,0,0,0,null,999,null,0]
[null,null,null,null,null,null,null,null,null,null,null,null,null,null,null,null,null,null,null,null,null,null,null,null,null,null,null,null,null,null,null,null,null,null,null,null,null,null,null,null,null,null,null,null,null,null,null,null,null,null,null,null,null,null,null,null,null,null,null,null,0,0,0,0,null,999,null,0]
[null,null,null,null,null,null,null,null,null,null,null,null,null,null,null,null,null,null,null,null,null,null,null,null,null,null,null,null,null,null,null,null,null,null,null,null,null,null,null,null,null,null,null,null,null,null,null,null,null,null,null,null,null,null,null,null,null,null,null,null,0,0,0,0,null,999,null,0]
[null,null,null,null,null,null,null,null,null,null,null,null,null,null,null,null,null,null,null,null,null,null,null,null,null,null,null,null,null,null,null,null,null,null,null,null,null,null,null,null,null,null,null,null,null,null,null,null,null,null,null,null,null,null,null,null,null,null,null,null,0,0,0,0,null,999,null,0]
[null,null,null,null,null,null,null,null,null,null,null,null,null,null,null,null,null,null,null,null,null,null,null,null,null,null,null,null,null,null,null,null,null,null,null,null,null,null,null,null,null,null,null,null,null,null,null,null,null,null,null,null,null,null,null,null,null,null,null,null,0,0,0,0,null,999,null,0]
[null,null,null,null,null,null,null,null,null,null,null,null,null,null,null,null,null,null,null,null,null,null,null,null,null,null,null,null,null,null,null,null,null,null,null,null,null,null,null,null,null,null,null,null,null,null,null,null,null,null,null,null,null,null,null,null,null,null,null,null,0,0,0,0,null,999,null,0]
[null,null,null,null,null,null,null,null,null,null,null,null,null,null,null,null,null,null,null,null,null,null,null,null,null,null,null,null,null,null,null,null,null,null,null,null,null,null,null,null,null,null,null,null,null,null,null,null,null,null,null,null,null,null,null,null,null,null,null,null,0,0,0,0,null,999,null,0]
[null,null,null,null,null,null,null,null,null,null,null,null,null,null,null,null,null,null,null,null,null,null,null,null,null,null,null,null,null,null,null,null,null,null,null,null,null,null,null,null,null,null,null,null,null,null,null,null,null,null,null,null,null,null,null,null,null,null,null,null,0,0,0,0,null,999,null,0]
[null,null,null,null,null,null,null,null,null,null,null,null,null,null,null,null,null,null,null,null,null,null,null,null,null,null,null,null,null,null,null,null,null,null,null,null,null,null,null,null,null,null,null,null,null,null,null,null,null,null,null,null,null,null,null,null,null,null,null,null,0,0,0,0,null,999,null,0]
[null,null,null,null,null,null,null,null,null,null,null,null,null,null,null,null,null,null,null,null,null,null,null,null,null,null,null,null,null,null,null,null,null,null,null,null,null,null,null,null,null,null,null,null,null,null,null,null,null,null,null,null,null,null,null,null,null,null,null,null,0,0,0,0,null,999,null,0]
[null,null,null,null,null,null,null,null,null,null,null,null,null,null,null,null,null,null,null,null,null,null,null,null,null,null,null,null,null,null,null,null,null,null,null,null,null,null,null,null,null,null,null,null,null,null,null,null,null,null,null,null,null,null,null,null,null,null,null,null,0,0,0,0,null,999,null,0]
[null,null,null,null,null,null,null,null,null,null,null,null,null,null,null,null,null,null,null,null,null,null,null,null,null,null,null,null,null,null,null,null,null,null,null,null,null,null,null,null,null,null,null,null,null,null,null,null,null,null,null,null,null,null,null,null,null,null,null,null,0,0,0,0,null,999,null,0]
[null,null,null,null,null,null,null,null,null,null,null,null,null,null,null,null,null,null,null,null,null,null,null,null,null,null,null,null,null,null,null,null,null,null,null,null,null,null,null,null,null,null,null,null,null,null,null,null,null,null,null,null,null,null,null,null,null,null,null,null,0,0,0,0,null,999,null,0]
[null,null,null,null,null,null,null,null,null,null,null,null,null,null,null,null,null,null,null,null,null,null,null,null,null,null,null,null,null,null,null,null,null,null,null,null,null,null,null,null,null,null,null,null,null,null,null,null,null,null,null,null,null,null,null,null,null,null,null,null,0,0,0,0,null,999,null,0]
[null,null,null,null,null,null,null,null,null,null,null,null,null,null,null,null,null,null,null,null,null,null,null,null,null,null,null,null,null,null,null,null,null,null,null,null,null,null,null,null,null,null,null,null,null,null,null,null,null,null,null,null,null,null,null,null,null,null,null,null,0,0,0,0,null,999,null,0]
[null,null,null,null,null,null,null,null,null,null,null,null,null,null,null,null,null,null,null,null,null,null,null,null,null,null,null,null,null,null,null,null,null,null,null,null,null,null,null,null,null,null,null,null,null,null,null,null,null,null,null,null,null,null,null,null,null,null,null,null,0,0,0,0,null,999,null,0]
[null,null,null,null,null,null,null,null,null,null,null,null,null,null,null,null,null,null,null,null,null,null,null,null,null,null,null,null,null,null,null,null,null,null,null,null,null,null,null,null,null,null,null,null,null,null,null,null,null,null,null,null,null,null,null,null,null,null,null,null,0,0,0,0,null,999,null,0]
[null,null,null,null,null,null,null,null,null,null,null,null,null,null,null,null,null,null,null,null,null,null,null,null,null,null,null,null,null,null,null,null,null,null,null,null,null,null,null,null,null,null,null,null,null,null,null,null,null,null,null,null,null,null,null,null,null,null,null,null,0,0,0,0,null,999,null,0]
[null,null,null,null,null,null,null,null,null,null,null,null,null,null,null,null,null,null,null,null,null,null,null,null,null,null,null,null,null,null,null,null,null,null,null,null,null,null,null,null,null,null,null,null,null,null,null,null,null,null,null,null,null,null,null,null,null,null,null,null,0,0,0,0,null,999,null,0]
[null,null,null,null,null,null,null,null,null,null,null,null,null,null,null,null,null,null,null,null,null,null,null,null,null,null,null,null,null,null,null,null,null,null,null,null,null,null,null,null,null,null,null,null,null,null,null,null,null,null,null,null,null,null,null,null,null,null,null,null,0,0,0,0,null,999,null,0]
[null,null,null,null,null,null,null,null,null,null,null,null,null,null,null,null,null,null,null,null,null,null,null,null,null,null,null,null,null,null,null,null,null,null,null,null,null,null,null,null,null,null,null,null,null,null,null,null,null,null,null,null,null,null,null,null,null,null,null,null,0,0,0,0,null,999,null,0]
[null,null,null,null,null,null,null,null,null,null,null,null,null,null,null,null,null,null,null,null,null,null,null,null,null,null,null,null,null,null,null,null,null,null,null,null,null,null,null,null,null,null,null,null,null,null,null,null,null,null,null,null,null,null,null,null,null,null,null,null,0,0,0,0,null,999,null,0]
[null,null,null,null,null,null,null,null,null,null,null,null,null,null,null,null,null,null,null,null,null,null,null,null,null,null,null,null,null,null,null,null,null,null,null,null,null,null,null,null,null,null,null,null,null,null,null,null,null,null,null,null,null,null,null,null,null,null,null,null,0,0,0,0,null,999,null,0]
[null,null,null,null,null,null,null,null,null,null,null,null,null,null,null,null,null,null,null,null,null,null,null,null,null,null,null,null,null,null,null,null,null,null,null,null,null,null,null,null,null,null,null,null,null,null,null,null,null,null,null,null,null,null,null,null,null,null,null,null,0,0,0,0,null,999,null,0]
[null,null,null,null,null,null,null,null,null,null,null,null,null,null,null,null,null,null,null,null,null,null,null,null,null,null,null,null,null,null,null,null,null,null,null,null,null,null,null,null,null,null,null,null,null,null,null,null,null,null,null,null,null,null,null,null,null,null,null,null,0,0,0,0,null,999,null,0]
[null,null,null,null,null,null,null,null,null,null,null,null,null,null,null,null,null,null,null,null,null,null,null,null,null,null,null,null,null,null,null,null,null,null,null,null,null,null,null,null,null,null,null,null,null,null,null,null,null,null,null,null,null,null,null,null,null,null,null,null,0,0,0,0,null,999,null,0]
[null,null,null,null,null,null,null,null,null,null,null,null,null,null,null,null,null,null,null,null,null,null,null,null,null,null,null,null,null,null,null,null,null,null,null,null,null,null,null,null,null,null,null,null,null,null,null,null,null,null,null,null,null,null,null,null,null,null,null,null,0,0,0,0,null,999,null,0]
[null,null,null,null,null,null,null,null,null,null,null,null,null,null,null,null,null,null,null,null,null,null,null,null,null,null,null,null,null,null,null,null,null,null,null,null,null,null,null,null,null,null,null,null,null,null,null,null,null,null,null,null,null,null,null,null,null,null,null,null,0,0,0,0,null,999,null,0]
[null,null,null,null,null,null,null,null,null,null,null,null,null,null,null,null,null,null,null,null,null,null,null,null,null,null,null,null,null,null,null,null,null,null,null,null,null,null,null,null,null,null,null,null,null,null,null,null,null,null,null,null,null,null,null,null,null,null,null,null,0,0,0,0,null,999,null,0]
[null,null,null,null,null,null,null,null,null,null,null,null,null,null,null,null,null,null,null,null,null,null,null,null,null,null,null,null,null,null,null,null,null,null,null,null,null,null,null,null,null,null,null,null,null,null,null,null,null,null,null,null,null,null,null,null,null,null,null,null,0,0,0,0,null,999,null,0]
[null,null,null,null,null,null,null,null,null,null,null,null,null,null,null,null,null,null,null,null,null,null,null,null,null,null,null,null,null,null,null,null,null,null,null,null,null,null,null,null,null,null,null,null,null,null,null,null,null,null,null,null,null,null,null,null,null,null,null,null,0,0,0,0,null,999,null,0]
[null,null,null,null,null,null,null,null,null,null,null,null,null,null,null,null,null,null,null,null,null,null,null,null,null,null,null,null,null,null,null,null,null,null,null,null,null,null,null,null,null,null,null,null,null,null,null,null,null,null,null,null,null,null,null,null,null,null,null,null,0,0,0,0,null,999,null,0]
[null,null,null,null,null,null,null,null,null,null,null,null,null,null,null,null,null,null,null,null,null,null,null,null,null,null,null,null,null,null,null,null,null,null,null,null,null,null,null,null,null,null,null,null,null,null,null,null,null,null,null,null,null,null,null,null,null,null,null,null,{"$f":"_xlfn.NUMBERVALUE(IF(AND($G323>=($U$151-$Y$151),$G323<=($U$151+$Y$151)),B323,\"\"))","v":0},{"$f":"_xlfn.NUMBERVALUE(IFERROR(+BI496*$W$149,\"\"))","v":0},{"$f":"_xlfn.NUMBERVALUE(IF(AND($G323>=($U$151-$Y$151),$G323<=($U$151+$Y$151)),C323,\"\"))","v":0},{"$f":"_xlfn.NUMBERVALUE(IF(AND($G323>=($U$151-$Y$151),$G323<=($U$151+$Y$151)),G323,\"\"))","v":0},null,{"$f":"IF(BJ496=0,999,BJ496)","v":999},null,{"$f":"+BK496*$BP$172","v":0}]
[null,null,null,null,null,null,null,null,null,null,null,null,null,null,null,null,null,null,null,null,null,null,null,null,null,null,null,null,null,null,null,null,null,null,null,null,null,null,null,null,null,null,null,null,null,null,null,null,null,null,null,null,null,null,null,null,null,null,null,null,0,0,0,0,null,999,null,0]
[null,null,null,null,null,null,null,null,null,null,null,null,null,null,null,null,null,null,null,null,null,null,null,null,null,null,null,null,null,null,null,null,null,null,null,null,null,null,null,null,null,null,null,null,null,null,null,null,null,null,null,null,null,null,null,null,null,null,null,null,89.473684210526301,3774.8947368421,40,106,null,3774.8947368421,null,37.220363602009435]
[null,null,null,null,null,null,null,null,null,null,null,null,null,null,null,null,null,null,null,null,null,null,null,null,null,null,null,null,null,null,null,null,null,null,null,null,null,null,null,null,null,null,null,null,null,null,null,null,null,null,null,null,null,null,null,null,null,null,null,null,0,0,0,0,null,999,null,0]
[null,null,null,null,null,null,null,null,null,null,null,null,null,null,null,null,null,null,null,null,null,null,null,null,null,null,null,null,null,null,null,null,null,null,null,null,null,null,null,null,null,null,null,null,null,null,null,null,null,null,null,null,null,null,null,null,null,null,null,null,0,0,0,0,null,999,null,0]
[null,null,null,null,null,null,null,null,null,null,null,null,null,null,null,null,null,null,null,null,null,null,null,null,null,null,null,null,null,null,null,null,null,null,null,null,null,null,null,null,null,null,null,null,null,null,null,null,null,null,null,null,null,null,null,null,null,null,null,null,0,0,0,0,null,999,null,0]
[null,null,null,null,null,null,null,null,null,null,null,null,null,null,null,null,null,null,null,null,null,null,null,null,null,null,null,null,null,null,null,null,null,null,null,null,null,null,null,null,null,null,null,null,null,null,null,null,null,null,null,null,null,null,null,null,null,null,null,null,0,0,0,0,null,999,null,0]
[null,null,null,null,null,null,null,null,null,null,null,null,null,null,null,null,null,null,null,null,null,null,null,null,null,null,null,null,null,null,null,null,null,null,null,null,null,null,null,null,null,null,null,null,null,null,null,null,null,null,null,null,null,null,null,null,null,null,null,null,0,0,0,0,null,999,null,0]
[null,null,null,null,null,null,null,null,null,null,null,null,null,null,null,null,null,null,null,null,null,null,null,null,null,null,null,null,null,null,null,null,null,null,null,null,null,null,null,null,null,null,null,null,null,null,null,null,null,null,null,null,null,null,null,null,null,null,null,null,0,0,0,0,null,999,null,0]
[null,null,null,null,null,null,null,null,null,null,null,null,null,null,null,null,null,null,null,null,null,null,null,null,null,null,null,null,null,null,null,null,null,null,null,null,null,null,null,null,null,null,null,null,null,null,null,null,null,null,null,null,null,null,null,null,null,null,null,null,0,0,0,0,null,999,null,0]
[null,null,null,null,null,null,null,null,null,null,null,null,null,null,null,null,null,null,null,null,null,null,null,null,null,null,null,null,null,null,null,null,null,null,null,null,null,null,null,null,null,null,null,null,null,null,null,null,null,null,null,null,null,null,null,null,null,null,null,null,0,0,0,0,null,999,null,0]
[null,null,null,null,null,null,null,null,null,null,null,null,null,null,null,null,null,null,null,null,null,null,null,null,null,null,null,null,null,null,null,null,null,null,null,null,null,null,null,null,null,null,null,null,null,null,null,null,null,null,null,null,null,null,null,null,null,null,null,null,0,0,0,0,null,999,null,0]
[null,null,null,null,null,null,null,null,null,null,null,null,null,null,null,null,null,null,null,null,null,null,null,null,null,null,null,null,null,null,null,null,null,null,null,null,null,null,null,null,null,null,null,null,null,null,null,null,null,null,null,null,null,null,null,null,null,null,null,null,0,0,0,0,null,999,null,0]
[null,null,null,null,null,null,null,null,null,null,null,null,null,null,null,null,null,null,null,null,null,null,null,null,null,null,null,null,null,null,null,null,null,null,null,null,null,null,null,null,null,null,null,null,null,null,null,null,null,null,null,null,null,null,null,null,null,null,null,null,0,0,0,0,null,999,null,0]
[null,null,null,null,null,null,null,null,null,null,null,null,null,null,null,null,null,null,null,null,null,null,null,null,null,null,null,null,null,null,null,null,null,null,null,null,null,null,null,null,null,null,null,null,null,null,null,null,null,null,null,null,null,null,null,null,null,null,null,null,0,0,0,0,null,999,null,0]
[null,null,null,null,null,null,null,null,null,null,null,null,null,null,null,null,null,null,null,null,null,null,null,null,null,null,null,null,null,null,null,null,null,null,null,null,null,null,null,null,null,null,null,null,null,null,null,null,null,null,null,null,null,null,null,null,null,null,null,null,0,0,0,0,null,999,null,0]
[null,null,null,null,null,null,null,null,null,null,null,null,null,null,null,null,null,null,null,null,null,null,null,null,null,null,null,null,null,null,null,null,null,null,null,null,null,null,null,null,null,null,null,null,null,null,null,null,null,null,null,null,null,null,null,null,null,null,null,null,0,0,0,0,null,999,null,0]
[null,null,null,null,null,null,null,null,null,null,null,null,null,null,null,null,null,null,null,null,null,null,null,null,null,null,null,null,null,null,null,null,null,null,null,null,null,null,null,null,null,null,null,null,null,null,null,null,null,null,null,null,null,null,null,null,null,null,null,null,0,0,0,0,null,999,null,0]
[null,null,null,null,null,null,null,null,null,null,null,null,null,null,null,null,null,null,null,null,null,null,null,null,null,null,null,null,null,null,null,null,null,null,null,null,null,null,null,null,null,null,null,null,null,null,null,null,null,null,null,null,null,null,null,null,null,null,null,null,89.487870619946094,3775.49326145553,0,106,null,3775.49326145553,null,0]
[null,null,null,null,null,null,null,null,null,null,null,null,null,null,null,null,null,null,null,null,null,null,null,null,null,null,null,null,null,null,null,null,null,null,null,null,null,null,null,null,null,null,null,null,null,null,null,null,null,null,null,null,null,null,null,null,null,null,null,null,0,0,0,0,null,999,null,0]
[null,null,null,null,null,null,null,null,null,null,null,null,null,null,null,null,null,null,null,null,null,null,null,null,null,null,null,null,null,null,null,null,null,null,null,null,null,null,null,null,null,null,null,null,null,null,null,null,null,null,null,null,null,null,null,null,null,null,null,null,0,0,0,0,null,999,null,0]
[null,null,null,null,null,null,null,null,null,null,null,null,null,null,null,null,null,null,null,null,null,null,null,null,null,null,null,null,null,null,null,null,null,null,null,null,null,null,null,null,null,null,null,null,null,null,null,null,null,null,null,null,null,null,null,null,null,null,null,null,0,0,0,0,null,999,null,0]
[null,null,null,null,null,null,null,null,null,null,null,null,null,null,null,null,null,null,null,null,null,null,null,null,null,null,null,null,null,null,null,null,null,null,null,null,null,null,null,null,null,null,null,null,null,null,null,null,null,null,null,null,null,null,null,null,null,null,null,null,0,0,0,0,null,999,null,0]
[null,null,null,null,null,null,null,null,null,null,null,null,null,null,null,null,null,null,null,null,null,null,null,null,null,null,null,null,null,null,null,null,null,null,null,null,null,null,null,null,null,null,null,null,null,null,null,null,null,null,null,null,null,null,null,null,null,null,null,null,0,0,0,0,null,999,null,0]
[null,null,null,null,null,null,null,null,null,null,null,null,null,null,null,null,null,null,null,null,null,null,null,null,null,null,null,null,null,null,null,null,null,null,null,null,null,null,null,null,null,null,null,null,null,null,null,null,null,null,null,null,null,null,null,null,null,null,null,null,0,0,0,0,null,999,null,0]
[null,null,null,null,null,null,null,null,null,null,null,null,null,null,null,null,null,null,null,null,null,null,null,null,null,null,null,null,null,null,null,null,null,null,null,null,null,null,null,null,null,null,null,null,null,null,null,null,null,null,null,null,null,null,null,null,null,null,null,null,0,0,0,0,null,999,null,0]
[null,null,null,null,null,null,null,null,null,null,null,null,null,null,null,null,null,null,null,null,null,null,null,null,null,null,null,null,null,null,null,null,null,null,null,null,null,null,null,null,null,null,null,null,null,null,null,null,null,null,null,null,null,null,null,null,null,null,null,null,0,0,0,0,null,999,null,0]
[null,null,null,null,null,null,null,null,null,null,null,null,null,null,null,null,null,null,null,null,null,null,null,null,null,null,null,null,null,null,null,null,null,null,null,null,null,null,null,null,null,null,null,null,null,null,null,null,null,null,null,null,null,null,null,null,null,null,null,null,0,0,0,0,null,999,null,0]
[null,null,null,null,null,null,null,null,null,null,null,null,null,null,null,null,null,null,null,null,null,null,null,null,null,null,null,null,null,null,null,null,null,null,null,null,null,null,null,null,null,null,null,null,null,null,null,null,null,null,null,null,null,null,null,null,null,null,null,null,0,0,0,0,null,999,null,0]
[null,null,null,null,null,null,null,null,null,null,null,null,null,null,null,null,null,null,null,null,null,null,null,null,null,null,null,null,null,null,null,null,null,null,null,null,null,null,null,null,null,null,null,null,null,null,null,null,null,null,null,null,null,null,null,null,null,null,null,null,0,0,0,0,null,999,null,0]
[null,null,null,null,null,null,null,null,null,null,null,null,null,null,null,null,null,null,null,null,null,null,null,null,null,null,null,null,null,null,null,null,null,null,null,null,null,null,null,null,null,null,null,null,null,null,null,null,null,null,null,null,null,null,null,null,null,null,null,null,0,0,0,0,null,999,null,0]
[null,null,null,null,null,null,null,null,null,null,null,null,null,null,null,null,null,null,null,null,null,null,null,null,null,null,null,null,null,null,null,null,null,null,null,null,null,null,null,null,null,null,null,null,null,null,null,null,null,null,null,null,null,null,null,null,null,null,null,null,0,0,0,0,null,999,null,0]
[null,null,null,null,null,null,null,null,null,null,null,null,null,null,null,null,null,null,null,null,null,null,null,null,null,null,null,null,null,null,null,null,null,null,null,null,null,null,null,null,null,null,null,null,null,null,null,null,null,null,null,null,null,null,null,null,null,null,null,null,97.802197802197796,4126.2747252747204,120,106,null,4126.2747252747204,null,111.6610908060283]
[null,null,null,null,null,null,null,null,null,null,null,null,null,null,null,null,null,null,null,null,null,null,null,null,null,null,null,null,null,null,null,null,null,null,null,null,null,null,null,null,null,null,null,null,null,null,null,null,null,null,null,null,null,null,null,null,null,null,null,null,100,4219,180,123,null,4219,null,167.49163620904244]
[null,null,null,null,null,null,null,null,null,null,null,null,null,null,null,null,null,null,null,null,null,null,null,null,null,null,null,null,null,null,null,null,null,null,null,null,null,null,null,null,null,null,null,null,null,null,null,null,null,null,null,null,null,null,null,null,null,null,null,null,0,0,0,0,null,999,null,0]
[null,null,null,null,null,null,null,null,null,null,null,null,null,null,null,null,null,null,null,null,null,null,null,null,null,null,null,null,null,null,null,null,null,null,null,null,null,null,null,null,null,null,null,null,null,null,null,null,null,null,null,null,null,null,null,null,null,null,null,null,0,0,0,0,null,999,null,0]
[null,null,null,null,null,null,null,null,null,null,null,null,null,null,null,null,null,null,null,null,null,null,null,null,null,null,null,null,null,null,null,null,null,null,null,null,null,null,null,null,null,null,null,null,null,null,null,null,null,null,null,null,null,null,null,null,null,null,null,null,0,0,0,0,null,999,null,0]
[null,null,null,null,null,null,null,null,null,null,null,null,null,null,null,null,null,null,null,null,null,null,null,null,null,null,null,null,null,null,null,null,null,null,null,null,null,null,null,null,null,null,null,null,null,null,null,null,null,null,null,null,null,null,null,null,null,null,null,null,0,0,0,0,null,999,null,0]
[null,null,null,null,null,null,null,null,null,null,null,null,null,null,null,null,null,null,null,null,null,null,null,null,null,null,null,null,null,null,null,null,null,null,null,null,null,null,null,null,null,null,null,null,null,null,null,null,null,null,null,null,null,null,null,null,null,null,null,null,0,0,0,0,null,999,null,0]
[null,null,null,null,null,null,null,null,null,null,null,null,null,null,null,null,null,null,null,null,null,null,null,null,null,null,null,null,null,null,null,null,null,null,null,null,null,null,null,null,null,null,null,null,null,null,null,null,null,null,null,null,null,null,null,null,null,null,null,null,0,0,0,0,null,999,null,0]
[null,null,null,null,null,null,null,null,null,null,null,null,null,null,null,null,null,null,null,null,null,null,null,null,null,null,null,null,null,null,null,null,null,null,null,null,null,null,null,null,null,null,null,null,null,null,null,null,null,null,null,null,null,null,null,null,null,null,null,null,0,0,0,0,null,999,null,0]
[null,null,null,null,null,null,null,null,null,null,null,null,null,null,null,null,null,null,null,null,null,null,null,null,null,null,null,null,null,null,null,null,null,null,null,null,null,null,null,null,null,null,null,null,null,null,null,null,null,null,null,null,null,null,null,null,null,null,null,null,0,0,0,0,null,999,null,0]
[null,null,null,null,null,null,null,null,null,null,null,null,null,null,null,null,null,null,null,null,null,null,null,null,null,null,null,null,null,null,null,null,null,null,null,null,null,null,null,null,null,null,null,null,null,null,null,null,null,null,null,null,null,null,null,null,null,null,null,null,0,0,0,0,null,999,null,0]
[null,null,null,null,null,null,null,null,null,null,null,null,null,null,null,null,null,null,null,null,null,null,null,null,null,null,null,null,null,null,null,null,null,null,null,null,null,null,null,null,null,null,null,null,null,null,null,null,null,null,null,null,null,null,null,null,null,null,null,null,0,0,0,0,null,999,null,0]
[null,null,null,null,null,null,null,null,null,null,null,null,null,null,null,null,null,null,null,null,null,null,null,null,null,null,null,null,null,null,null,null,null,null,null,null,null,null,null,null,null,null,null,null,null,null,null,null,null,null,null,null,null,null,null,null,null,null,null,null,0,0,0,0,null,999,null,0]
[null,null,null,null,null,null,null,null,null,null,null,null,null,null,null,null,null,null,null,null,null,null,null,null,null,null,null,null,null,null,null,null,null,null,null,null,null,null,null,null,null,null,null,null,null,null,null,null,null,null,null,null,null,null,null,null,null,null,null,null,0,0,0,0,null,999,null,0]
[null,null,null,null,null,null,null,null,null,null,null,null,null,null,null,null,null,null,null,null,null,null,null,null,null,null,null,null,null,null,null,null,null,null,null,null,null,null,null,null,null,null,null,null,null,null,null,null,null,null,null,null,null,null,null,null,null,null,null,null,0,0,0,0,null,999,null,0]
[null,null,null,null,null,null,null,null,null,null,null,null,null,null,null,null,null,null,null,null,null,null,null,null,null,null,null,null,null,null,null,null,null,null,null,null,null,null,null,null,null,null,null,null,null,null,null,null,null,null,null,null,null,null,null,null,null,null,null,null,0,0,0,0,null,999,null,0]
[null,null,null,null,null,null,null,null,null,null,null,null,null,null,null,null,null,null,null,null,null,null,null,null,null,null,null,null,null,null,null,null,null,null,null,null,null,null,null,null,null,null,null,null,null,null,null,null,null,null,null,null,null,null,null,null,null,null,null,null,82.575024201355305,3483.84027105518,0,105,null,3483.84027105518,null,0]
[null,null,null,null,null,null,null,null,null,null,null,null,null,null,null,null,null,null,null,null,null,null,null,null,null,null,null,null,null,null,null,null,null,null,null,null,null,null,null,null,null,null,null,null,null,null,null,null,null,null,null,null,null,null,null,null,null,null,null,null,0,0,0,0,null,999,null,0]
[null,null,null,null,null,null,null,null,null,null,null,null,null,null,null,null,null,null,null,null,null,null,null,null,null,null,null,null,null,null,null,null,null,null,null,null,null,null,null,null,null,null,null,null,null,null,null,null,null,null,null,null,null,null,null,null,null,null,null,null,0,0,0,0,null,999,null,0]
[null,null,null,null,null,null,null,null,null,null,null,null,null,null,null,null,null,null,null,null,null,null,null,null,null,null,null,null,null,null,null,null,null,null,null,null,null,null,null,null,null,null,null,null,null,null,null,null,null,null,null,null,null,null,null,null,null,null,null,null,0,0,0,0,null,999,null,0]
[null,null,null,null,null,null,null,null,null,null,null,null,null,null,null,null,null,null,null,null,null,null,null,null,null,null,null,null,null,null,null,null,null,null,null,null,null,null,null,null,null,null,null,null,null,null,null,null,null,null,null,null,null,null,null,null,null,null,null,null,0,0,0,0,null,999,null,0]

{"sheet":"K on Soybean","index":1,"n_rows":548,"n_cols":78,"rows_kept":548,"cut":false,"hidden":false,"merged":[[186,17,187,18],[142,16,142,24],[183,16,183,24]]}
[null,"RELYLD","KRATE","YEAR","SITE","YEAROB","KSOIL","DCLAY"]
[1,90.049140049140036,0,2004,1,1,101,0,null,null,null,null,null,null,null,null,"Rice Price",null,null,null,10,"$/cwt",null,null,"Conventional"]
[2,91.769041769041763,40,2004,1,14,101,0,null,"Dependent Variable: RELYLD",null,null,null,null,null,null,null,null,null,null,null,null,null,null,"Clearfield"]
[3,89.312039312039303,80,2004,1,31,101,0,null,"Method: Panel EGLS (Period random effects)",null,null,null,null,null,null,"Cost of K (0-0-60)",null,null,null,450,"$/ton"]
[4,100,120,2004,1,41,101,0,null,"Date: 03/12/19   Time: 15:57",null,null,null,null,null,null,null,null,null,null,null,null,null,null,"Clay"]
[5,96.928746928746932,160,2004,1,52,101,0,null,"Sample: 2001 2018 IF KRATE<>135",null,null,null,null,null,null,"How much K do you currently apply per acre?",null,null,null,25,"lbs/acre",null,null,"Loam"]
[6,77.508650519031136,0,2004,3,2,85,0,null,"Periods included: 17"]
[7,82.525951557093435,30,2004,3,12,86,0,null,"Cross-sections included: 79",null,null,null,null,null,null,"What yield do you expect at that application rate?",null,null,null,180,"bu/acre",null,null,"Yes"]
[8,100,60,2004,3,23,85,0,null,"Total panel (unbalanced) observations: 440",null,null,null,null,null,null,null,null,null,null,null,null,null,null,"No"]
[9,99.307958477508649,90,2004,3,39,89,0,null,"Wallace and Hussain estimator of component variances",null,null,null,null,null,null,"Do you use conventional or hybrid seed?",null,null,null,"Conventional"]
[10,96.7128027681661,120,2004,3,42,95,0]
[11,69.817073170731717,0,2004,4,3,73,0,null,"Variable","Coefficient","Std. Error","t-Statistic","Prob.  ",null,null,"What is your soil test K?",null,null,null,110]
[12,83.536585365853668,30,2004,4,13,80,0]
[13,87.042682926829272,60,2004,4,24,78,0,null,"C",85.531903931343507,1.0887681974460901,78.5584150345084,1.52334084563578E-257,null,null,"Does the field have mostly clayey or loamy soil texture?",null,null,null,"Loam"]
[14,91.615853658536594,90,2004,4,40,79,0,null,"DRREC",1.8218734362598099,0.61695284893863001,2.9530189209662501,3.3189332097646098E-3]
[15,100,120,2004,4,43,85,0,null,"KRATE",0.15462761258478799,1.68022741166984E-2,9.2027788328436202,1.51928926815474E-18,null,null,"Do you operate South of I-40?",null,null,null,"No"]
[16,74.812030075187963,0,2005,5,1,71,0,null,"KRATE^2",-4.2195811300604799E-4,8.7108479998345494E-5,-4.8440532197790898,1.77718926043751E-6]
[17,84.022556390977442,30,2005,5,12,70,0,null,"DCLFIELD",2.25413928281827,0.92655603374247097,2.4328148549349198,1.5387838751224099E-2,null,null,"Predicted RELYLD based on above questions:",null,null,null,{"$f":"+K14+IF($U$16=\"Yes\",K15,0)+$U$6*($U$12*K21+K16+IF($U$10=\"Clearfield\",K23,0))+$U$6^2*(K17+IF($U$14=\"Clay\",K22))+IF($U$14=\"Clay\",K20,0)+IF($U$10=\"Clearfield\",K18,0)+$U$12*K19","v":93.328781846137147}]
[18,89.473684210526315,60,2005,5,23,81,0,null,"KSOIL",4.8135418919568303E-2,9.6227532755463804E-3,5.0022501399772299,8.2652555394556796E-7]
[19,94.548872180451113,90,2005,5,39,92,0,null,"DCLAY",-3.2678032569792799,1.6364469951037599,-1.99688915483148,4.6465607051286599E-2,null,null,"Yield/RELYLD",null,null,null,{"$f":"+U8/U18","v":1.9286654817454918}]
[20,100,120,2005,5,41,91,0,null,"KSOIL*KRATE",-3.9999442194537998E-4,8.7972098694473307E-5,-4.5468327785899403,7.0861123117113604E-6]
[21,70.805369127516784,0,2005,6,2,65,0,null,"DCLAY*KRATE^2",null,null,null,null,null,null,"dRELYLD/dKRATE",null,null,null,{"$f":"+K16+U12*K21+IF(U10=\"Clearfield\",K23,0)+2*U6*(K17+IF(U14=\"Clay\",K22))","v":8.9530320520493797E-2},null,{"$f":"+K16+U12*K21+IF(U10=\"Clearfield\",K23,0)+2*U28*(K17+IF(U14=\"Clay\",K22))","v":4.3164561603838428E-2}]
[22,81.040268456375827,30,2005,6,13,68,0,null,"DCLFIELD*KRATE",-2.08785687496169E-2,9.5664735416848001E-3,-2.1824728473497501,2.96137948544343E-2]
[23,94.630872483221466,60,2005,6,24,63,0,null,null,null,null,null,null,null,null,{"$f":"CONCATENATE(\"VMP of K @ KRATE =  \",U6,\" lbs/acre and soil test K of \",U12)","v":"VMP of K @ KRATE =  25 lbs/acre and soil test K of 110"},null,null,null,{"$f":"+U22*U2/2.22*U20","v":0.77781098539408311},null,{"$f":"+W22*U2/2.22*U20","v":0.37499999999999994}]
[24,92.785234899328856,90,2005,6,40,83,0,null,null,"Effects Specification"]
[25,100,120,2005,6,42,79,0,null,null,null,null,"S.D.  ","Rho  ",null,null,"Cost per lb of K",null,null,null,{"$f":"+U4/0.6/2000","v":0.375}]
[26,96.963946869070199,0,2005,8,3,154,0]
[27,100,40,2005,8,14,154,0,null,"Period random",null,null,1.0600971748826,4.7688267843004797E-2,null,null,"Profit Maximizing K rate:",null,null,null,{"$f":"IF((U26/(U2/2.22*U20)-(K16+U12*K21+IF(U10=\"Clearfield\",K23,0)))/(2*(K17+IF(U14=\"Clay\",K22)))>180,180,(U26/(U2/2.22*U20)-(K16+U12*K21+IF(U10=\"Clearfield\",K23,0)))/(2*(K17+IF(U14=\"Clay\",K22))))","v":79.941186681236772},null,125,"Alt User K"]
[28,98.861480075901326,80,2005,8,31,154,0,null,"Idiosyncratic random",null,null,4.7372845346977401,0.95231173215699505]
[29,94.307400379506646,120,2005,8,43,154,0,null,null,null,null,null,null,null,null,"Expected Yield at Profit-Maximizing K rate:",null,null,null,{"$f":"(+K14+IF(U16=\"Yes\",K15,0)+U28*(U12*K21+K16+IF(U10=\"Clearfield\",K23,0))+U28^2*(K17+IF(U14=\"Clay\",K22))+IF(U14=\"Clay\",K20,0)+IF(U10=\"Clearfield\",K18,0)+U12*K19)*U20","v":187.03038519479557},null,{"$f":"(+K14+IF(U16=\"Yes\",K15,0)+W28*(U12*K21+K16+IF(U10=\"Clearfield\",K23,0))+W28^2*(K17+IF(U14=\"Clay\",K22))+IF(U14=\"Clay\",K20,0)+IF(U10=\"Clearfield\",K18,0)+U12*K19)*U20","v":189.12924340277638}]
[30,99.240986717267546,160,2005,8,52,154,0,null,null,"Weighted Statistics"]
[31,77.477477477477478,0,2005,9,4,72,1,null,null,null,null,null,null,null,null,"Added Profit in $/acre",null,null,null,{"$f":"+(U30-U8)*U2/2.22-(U28-U6)*U26","v":11.065456772894635},null,{"$f":"+(W30-U8)*U2/2.22-(W28-U6)*U26","v":3.6227180305242399}]
[32,85.585585585585591,40,2005,9,15,72,1,null,"R-squared",0.29544205258799699,"    Mean dependent var",null,60.432687873492299]
[33,97.837837837837839,80,2005,9,32,72,1,null,"Adjusted R-squared",0.28236441087269298,"    S.D. dependent var",null,9.8841223268864802,null,null,null,null,null,null,null,null,null,null,null,null,null,null,null,null,null,null,null,null,null,null,null,null,null,null,null,null,null,null,null,null,null,null,null,null,null,null,null,null,null,null,null,null,null,"K rate","Exp. Yield"]
[34,98.738738738738732,120,2005,9,44,72,1,null,"S.E. of regression",4.7439141955850399,"    Sum squared resid",null,9699.5351367765797,null,null,null,null,null,null,null,null,null,null,null,null,null,null,null,null,null,null,null,null,null,null,null,null,null,null,null,null,null,null,null,null,null,null,null,null,null,null,null,null,null,null,null,null,null,0,{"$f":"(+$K$14+IF($U$16=\"Yes\",$K$15,0)+BH35*($U$12*$K$21+$K$16+IF($U$10=\"Clearfield\",$K$23,0))+BH35^2*($K$17+IF($U$14=\"Clay\",$K$22))+IF($U$14=\"Clay\",$K$20,0)+IF($U$10=\"Clearfield\",$K$18,0)+$U$12*$K$19)*$U$20","v":175.17451400150208}]
[35,100,160,2005,9,53,72,1,null,"F-statistic",22.591386048010399,"    Durbin-Watson stat",null,2.4906446401097999,null,null,null,null,null,null,null,null,null,null,null,null,null,null,null,null,null,null,null,null,null,null,null,null,null,null,null,null,null,null,null,null,null,null,null,null,null,null,null,null,null,null,null,null,null,10,{"$f":"(+$K$14+IF($U$16=\"Yes\",$K$15,0)+BH36*($U$12*$K$21+$K$16+IF($U$10=\"Clearfield\",$K$23,0))+BH36^2*($K$17+IF($U$14=\"Clay\",$K$22))+IF($U$14=\"Clay\",$K$20,0)+IF($U$10=\"Clearfield\",$K$18,0)+$U$12*$K$19)*$U$20","v":177.22678080799585}]
[36,94.126284875183558,0,2005,10,5,167,0,null,"Prob(F-statistic)",7.6933271621005695E-29,null,null,null,null,null,null,null,null,null,null,null,null,null,null,null,null,null,null,null,null,null,null,null,null,null,null,null,null,null,null,null,null,null,null,null,null,null,null,null,null,null,null,null,null,null,null,null,null,20,179.11628440503014]
[37,94.713656387665196,40,2005,10,16,167,0,null,null,null,null,null,null,null,null,null,null,null,null,null,null,null,null,null,null,null,null,null,null,null,null,null,null,null,null,null,null,null,null,null,null,null,null,null,null,null,null,null,null,null,null,null,null,null,null,null,null,null,30,180.84302479260501]
[38,97.650513950073432,80,2005,10,33,167,0,null,null,"Unweighted Statistics",null,null,null,null,null,null,null,null,null,null,null,null,null,null,null,null,null,null,null,null,null,null,null,null,null,null,null,null,null,null,null,null,null,null,null,null,null,null,null,null,null,null,null,null,null,null,null,null,40,182.40700197072042]
[39,99.853157121879605,120,2005,10,45,167,0,null,null,null,null,null,null,null,null,null,null,null,null,null,null,null,null,null,null,null,null,null,null,null,null,null,null,null,null,null,null,null,null,null,null,null,null,null,null,null,null,null,null,null,null,null,null,null,null,null,null,null,50,183.80821593937642]
[40,100,160,2005,10,54,167,0,null,"R-squared",0.29611730962803401,"    Mean dependent var",null,95.920454545454504,null,null,null,null,null,null,null,null,null,null,null,null,null,null,null,null,null,null,null,null,null,null,null,null,null,null,null,null,null,null,null,null,null,null,null,null,null,null,null,null,null,null,null,null,null,60,185.04666669857292]
[41,92.028985507246361,0,2005,12,6,108,0,null,"Sum squared resid",10114.186042011301,"    Durbin-Watson stat",null,2.48242050670396,null,null,null,null,null,null,null,null,null,null,null,null,null,null,null,null,null,null,null,null,null,null,null,null,null,null,null,null,null,null,null,null,null,null,null,null,null,null,null,null,null,null,null,null,null,70,186.12235424831002]
[42,94.565217391304344,40,2005,12,17,108,0,null,null,null,null,null,null,null,null,null,null,null,null,null,null,null,null,null,null,null,null,null,null,null,null,null,null,null,null,null,null,null,null,null,null,null,null,null,null,null,null,null,null,null,null,null,null,null,null,null,null,null,80,187.03527858858763]
[43,99.094202898550719,80,2005,12,34,108,0,null,null,null,null,null,null,null,null,null,null,null,null,null,null,null,null,null,null,null,null,null,null,null,null,null,null,null,null,null,null,null,null,null,null,null,null,null,null,null,null,null,null,null,null,null,null,null,null,null,null,null,90,187.78543971940584]
[44,79.891304347826093,120,2005,12,46,108,0,null,null,null,null,null,null,null,null,null,null,null,null,null,null,null,null,null,null,null,null,null,null,null,null,null,null,null,null,null,null,null,null,null,null,null,null,null,null,null,null,null,null,null,null,null,null,null,null,null,null,null,100,188.3728376407646]
[45,100,160,2005,12,55,108,0,null,null,null,null,null,null,null,null,null,null,null,null,null,null,null,null,null,null,null,null,null,null,null,null,null,null,null,null,null,null,null,null,null,null,null,null,null,null,null,null,null,null,null,null,null,null,null,null,null,null,null,110,188.7974723526639]
[46,88.083735909822863,0,2006,13,1,102,0,null,null,null,null,{"$f":"174/192","v":0.90625},null,null,null,null,null,null,null,null,null,null,null,null,null,null,null,null,null,null,null,null,null,null,null,null,null,null,null,null,null,null,null,null,null,null,null,null,null,null,null,null,null,null,null,null,null,null,120,189.05934385510372]
[47,91.143317230273752,40,2006,13,14,102,0,null,null,null,null,null,null,null,null,null,null,null,null,null,null,null,null,null,null,null,null,null,null,null,null,null,null,null,null,null,null,null,null,null,null,null,null,null,null,null,null,null,null,null,null,null,null,null,null,null,null,null,130,189.15845214808414]
[48,100,80,2006,13,31,102,0,null,null,null,null,null,null,null,null,null,null,null,null,null,null,null,null,null,null,null,null,null,null,null,null,null,null,null,null,null,null,null,null,null,null,null,null,null,null,null,null,null,null,null,null,null,null,null,null,null,null,null,140,189.09479723160507]
[49,99.838969404186798,120,2006,13,41,102,0,null,null,null,null,null,null,null,null,null,null,null,null,null,null,null,null,null,null,null,null,null,null,null,null,null,null,null,null,null,null,null,null,null,null,null,null,null,null,null,null,null,null,null,null,null,null,null,null,null,null,null,150,188.86837910566663]
[50,98.711755233494358,160,2006,13,52,102,0,null,null,null,null,null,null,null,null,null,null,null,null,null,null,null,null,null,null,null,null,null,null,null,null,null,null,null,null,null,null,null,null,null,null,null,null,null,null,null,null,null,null,null,null,null,null,null,null,null,null,null,160,188.47919777026871]
[51,92.508710801393732,0,2006,14,2,104,0,null,null,null,null,null,null,null,null,null,null,null,null,null,null,null,null,null,null,null,null,null,null,null,null,null,null,null,null,null,null,null,null,null,null,null,null,null,null,null,null,null,null,null,null,null,null,null,null,null,null,null,170,187.92725322541133]
[52,95.470383275261312,40,2006,14,15,104,0,null,null,null,null,null,null,null,null,null,null,null,null,null,null,null,null,null,null,null,null,null,null,null,null,null,null,null,null,null,null,null,null,null,null,null,null,null,null,null,null,null,null,null,null,null,null,null,null,null,null,null,180,187.2125454710945]
[53,95.470383275261312,80,2006,14,32,104,0]
[54,99.303135888501743,120,2006,14,42,104,0]
[55,100,160,2006,14,53,104,0]
[56,96.847414880201768,0,2006,15,3,154,0]
[57,94.829760403530912,40,2006,15,16,154,0,null,"Dependent Variable: RELYLD",null,null,null,null,null,null,"Predicted RELYLD based on above questions:",null,null,null,{"$f":"+K69+IF($U$16=\"Yes\",K70,0)+$U$6*($U$12*K76+K71+IF($U$10=\"Clearfield\",K77,0)+IF($U$14=\"Clay\",K78))+$U$6^0.5*K72+IF($U$14=\"Clay\",K75,0)+IF($U$10=\"Clearfield\",K73,0)+$U$12*K74","v":94.566945198811538}]
[58,98.738965952080704,80,2006,15,33,154,0,null,"Method: Panel EGLS (Period random effects)"]
[59,100,120,2006,15,43,154,0,null,"Date: 03/13/19   Time: 09:12",null,null,null,null,null,null,"Yield/RELYLD",null,null,null,{"$f":"+U8/U58","v":1.9034134984648117}]
[60,94.955863808322832,160,2006,15,54,154,0,null,"Sample: 2001 2018 IF KRATE<>135"]
[61,73.731343283582078,0,2006,17,4,86,0,null,"Periods included: 17",null,null,null,null,null,null,"dRELYLD/dKRATE",null,null,null,{"$f":"+K71+U12*K76+IF(U10=\"Clearfield\",K77,0)+IF(U14=\"Clay\",K78,0)+0.5*U6^-0.5*K72","v":5.9615107453487554E-2},null,{"$f":"+K71+U12*K76+IF(U10=\"Clearfield\",K77,0)+IF(U14=\"Clay\",K78,0)+0.5*U68^-0.5*K72","v":4.3737212154450339E-2}]
[62,82.388059701492551,40,2006,17,17,86,0,null,"Cross-sections included: 79"]
[63,93.28358208955224,80,2006,17,34,86,0,null,"Total panel (unbalanced) observations: 440",null,null,null,null,null,null,{"$f":"CONCATENATE(\"VMP of K @ KRATE =  \",U6,\" lbs/acre and soil test K of \",U12)","v":"VMP of K @ KRATE =  25 lbs/acre and soil test K of 110"},null,null,null,{"$f":"+U62*U2/2.22*U60","v":0.51113603711440714},null,{"$f":"+W62*U2/2.22*U60","v":0.37499999999999994}]
[64,98.208955223880594,120,2006,17,44,86,0,null,"Wallace and Hussain estimator of component variances"]
[65,100,160,2006,17,55,86,0,null,null,null,null,null,null,null,null,"Cost per lb of K",null,null,null,{"$f":"+U4/0.6/2000","v":0.375},null,{"$f":"(K71+U12*K76+IF(U10=\"Clearfield\",K77,0)+IF(U14=\"Clay\",K78)+0.5*W68^-0.5*K72)*U2/2.22*U60","v":1.3839809839067578},"VMP at Alt User K"]
[66,79.685039370078741,0,2006,20,5,103,0,null,"Variable","Coefficient","Std. Error","t-Statistic","Prob.  "]
[67,87.559055118110237,40,2006,20,18,108,0,null,null,null,null,null,null,null,null,"Optimal K",null,null,null,{"$f":"IF(((U66/(U2/2.22*U60)-(K71+U12*K76+IF(U10=\"Clearfield\",K77,0)+IF(U14=\"Clay\",K78,0)))*2/K72)^-2>180,180,((U66/(U2/2.22*U60)-(K71+U12*K76+IF(U10=\"Clearfield\",K77,0)+IF(U14=\"Clay\",K78,0)))*2/K72)^-2)","v":38.367544561875619},null,5,"Alt User K"]
[68,92.755905511811022,80,2006,20,35,118,0,null,"C",83.578024194847401,1.20659577850463,69.267625234383004,2.2750956979676501E-235]
[69,100,120,2006,20,45,131,0,null,"DRREC",1.90137269172526,0.611207364620451,3.1108471556228299,1.9897376464522699E-3,null,null,"Expected Yield",null,null,null,{"$f":"(+K69+IF(U16=\"Yes\",K70,0)+U68*(K71+IF(U10=\"Clearfield\",K77,0)+IF(U14=\"Clay\",K78,0)+U12*K76)+U68^0.5*(K72)+IF(U14=\"Clay\",K75,0)+IF(U10=\"Clearfield\",K73,0)+U12*K74)*U60","v":181.29329790088903},null,{"$f":"(K69+IF($U$16=\"Yes\",K70,0)+$W$68*($U$12*K76+K71+IF($U$10=\"Clearfield\",K77,0)+IF($U$14=\"Clay\",K78,0))+$W$68^0.5*K72+IF($U$14=\"Clay\",K75,0)+IF($U$10=\"Clearfield\",K73,0)+$U$12*K74)*U60","v":176.53298178147375}]
[70,94.803149606299215,160,2006,20,56,133,0,null,"KRATE",5.52742460889597E-2,1.9451119658015902E-2,2.8416999669312499,4.7008195051331499E-3]
[71,77.483443708609272,0,2006,21,6,96,0,null,"KRATE^.5",0.82359665888312805,0.17954385041366799,4.5871616153132599,5.9022854645111403E-6,null,null,"Added Profit in $/acre",null,null,null,{"$f":"+(U70-U8)*U2/2.22-(U68-U6)*U66","v":0.81283700951749793},null,{"$f":"+(W70-U8)*U2/2.22-(W68-U6)*U66","v":-8.1171991825506691}]
[72,85.099337748344368,40,2006,21,19,95,0,null,"DCLFIELD",2.3332614357395598,0.91706877676773202,2.5442600324517501,1.1299725801368E-2]
[73,92.549668874172184,80,2006,21,36,94,0,null,"KSOIL",6.7632287912901295E-2,1.0982638763412E-2,6.15810911838543,1.69129017958203E-9]
[74,97.847682119205302,120,2006,21,46,111,0,null,"DCLAY",-9.2966107938057601,2.44179543787327,-3.80728485671299,1.60919576848023E-4]
[75,100,160,2006,21,57,123,0,null,"KSOIL*KRATE",-7.0926185930713596E-4,1.2399222892968301E-4,-5.7202121893410096,1.9952072499410899E-8,null,null,"K rate","Exp. Yield"]
[76,64.688427299703264,0,2007,22,1,60,0,null,"DCLFIELD*KRATE",-2.1130216011934499E-2,9.4468218525947407E-3,-2.2367539413406701,2.5814344277088699E-2,null,null,0.01,{"$f":"(+$K$69+IF($U$16=\"Yes\",$K$70,0)+Q77*($U$12*$K$76+$K$71+IF($U$10=\"Clearfield\",$K$77,0)+IF($U$14=\"Clay\",$K$78,0))+Q77^0.5*($K$72)+IF($U$14=\"Clay\",$K$75,0)+IF($U$10=\"Clearfield\",$K$73,0)+$U$12*$K$74)*$U$60","v":173.40041407627885}]
[77,86.646884272997028,40,2007,22,14,72,0,null,"DCLAY*KRATE",9.2406560478107802E-2,2.7666102147056101E-2,3.3400643136113199,9.1062959029147102E-4,null,null,2,175.37448271729784]
[78,89.910979228486639,80,2007,22,31,78,0,null,null,null,null,null,null,null,null,7,177.08863521093923]
[79,100,120,2007,22,41,81,0,null,null,"Effects Specification",null,null,null,null,null,15,178.66616097564972]
[80,92.284866468842736,160,2007,22,52,96,0,null,null,null,null,"S.D.  ","Rho  ",null,null,25,180]
[81,65.507649513212797,0,2007,23,2,71,0,null,null,null,null,null,null,null,null,45,181.81201135919036]
[82,91.098748261474256,40,2007,23,15,67,0,null,"Period random",null,null,1.09988001926412,5.2379790785103401E-2,null,null,60,182.78947046556192]
[83,94.019471488178013,80,2007,23,32,72,0,null,"Idiosyncratic random",null,null,4.6782194465974003,0.94762020921489598,null,null,70,183.3294805862167]
[84,92.628650904033364,120,2007,23,42,78,0,null,null,null,null,null,null,null,null,80,183.80214165492671]
[85,100,160,2007,23,53,97,0,null,null,"Weighted Statistics",null,null,null,null,null,90,184.21976180769644]
[86,82.853025936599408,0,2007,24,3,113,0,null,null,null,null,null,null,null,null,100,184.59130252343323]
[87,92.939481268011519,40,2007,24,16,113,0,null,"R-squared",0.31310372894456001,"    Mean dependent var",null,58.6943381945228,null,null,110,184.92352899484598]
[88,91.642651296829968,80,2007,24,33,113,0,null,"Adjusted R-squared",0.29872683024805102,"    S.D. dependent var",null,10.0022922776174,null,null,120,185.22169710371608]
[89,100,120,2007,24,43,113,0,null,"S.E. of regression",4.6850694834181299,"    Sum squared resid",null,9438.4467077160407,null,null,130,185.48998657691288]
[90,91.930835734870314,160,2007,24,54,113,0,null,"F-statistic",21.778252428013801,"    Durbin-Watson stat",null,2.4409488046449499,null,null,140,185.73178632091404]
[91,92.43027888446214,0,2007,26,4,102,0,null,"Prob(F-statistic)",1.97587979995919E-30,null,null,null,null,null,150,185.94988928056159]
[92,96.215139442231063,40,2007,26,17,102,0,null,null,null,null,null,null,null,null,160,186.14662959543867]
[93,100,80,2007,26,34,102,0,null,null,"Unweighted Statistics",null,null,null,null,null,170,186.32398165788015]
[94,95.019920318725099,120,2007,26,44,102,0,null,null,null,null,null,null,null,null,180,186.48363326015524]
[95,94.223107569721108,160,2007,26,55,102,0,null,"R-squared",0.31196952181203802,"    Mean dependent var",null,95.920454545454504]
[96,87.732342007434951,0,2007,27,5,139,0,null,"Sum squared resid",9886.4034506796197,"    Durbin-Watson stat",null,2.4312777860733799]
[97,88.847583643122675,40,2007,27,18,139,0]
[98,100,80,2007,27,35,139,0]
[99,94.423791821561338,120,2007,27,45,139,0]
[100,91.44981412639406,160,2007,27,56,139,0,null,"Dependent Variable: RELYLD",null,null,null,null,null,null,"Predicted RELYLD based on above questions:",null,null,null,{"$f":"+K112+IF($U$16=\"Yes\",K113,0)+LN($U$6)*(K117+$U$12*K120+IF($U$10=\"Clearfield\",K119,0)+IF($U$14=\"Clay\",K118))+IF($U$14=\"Clay\",K116,0)+IF($U$10=\"Clearfield\",K114,0)+$U$12*K115","v":96.183932265481602}]
[101,90.236220472440948,0,2007,28,6,272,1,null,"Method: Panel EGLS (Period random effects)"]
[102,100,40,2007,28,19,272,1,null,"Date: 03/13/19   Time: 16:57",null,null,null,null,null,null,"Yield/RELYLD",null,null,null,{"$f":"+U8/U101","v":1.871414442728063}]
[103,91.338582677165363,80,2007,28,36,272,1,null,"Sample: 2001 2018 IF KRATE<>135"]
[104,91.496062992125985,120,2007,28,46,272,1,null,"Periods included: 17",null,null,null,null,null,null,"dRELYLD/dKRATE",null,null,null,{"$f":"(K117+IF(U14=\"Clay\",K118,0)+IF(U10=\"Clearfield\",K119,0)+U12*K120)/U6","v":1.7019495542632695E-2},null,{"$f":"(K117+IF(U14=\"Clay\",K118,0)+IF(U10=\"Clearfield\",K119,0)+U12*K120)/U111","v":4.4485068672785247E-2}]
[105,93.228346456692918,160,2007,28,57,272,1,null,"Cross-sections included: 79"]
[106,90.354330708661422,0,2007,30,7,94,0,null,"Total panel (unbalanced) observations: 440",null,null,null,null,null,null,{"$f":"CONCATENATE(\"VMP of K @ KRATE =  \",U49,\" lbs/acre and soil test K of \",U55)","v":"VMP of K @ KRATE =   lbs/acre and soil test K of "},null,null,null,{"$f":"+U105*U2/2.22*U103","v":0.14347085480373295},null,{"$f":"+W105*U2/2.22*U103","v":0.37500000000000006}]
[107,97.440944881889763,40,2007,30,20,94,0,null,"Wallace and Hussain estimator of component variances"]
[108,100,80,2007,30,37,94,0,null,null,null,null,null,null,null,null,"Cost per lb of K",null,null,null,{"$f":"+U4/0.6/2000","v":0.375},null,{"$f":"(K117+IF(U14=\"Clay\",K118,0)+IF(U10=\"Clearfield\",K119,0)+U12*K120)/W111*U2/2.22*U103","v":0.71735427401866481},"VMP at Alt User K"]
[109,96.653543307086622,120,2007,30,47,94,0,null,"Variable","Coefficient","Std. Error","t-Statistic","Prob.  "]
[110,93.30708661417323,160,2007,30,58,94,0,null,null,null,null,null,null,null,null,"Optimal K",null,null,null,{"$f":"IF(((K117+IF(U14=\"Clay\",K118,0)+IF(U10=\"Clearfield\",K119,0)+U12*K120)/(U109/(U2/2.22*U103)))>180,180,((K117+IF(U14=\"Clay\",K118,0)+IF(U10=\"Clearfield\",K119,0)+U12*K120)/(U109/(U2/2.22*U103))))","v":9.5647236535821953},null,5,"Alt User K"]
[111,91.946308724832221,0,2007,31,8,94,0,null,"C",92.048356264197906,0.81185646957784696,113.380085906147,0]
[112,96.510067114093971,40,2007,31,21,94,0,null,"DRREC",1.6742729270431,0.62470994594087303,2.6800804724206602,7.6425083668557299E-3,null,null,"Expected Yield",null,null,null,{"$f":"(+K112+IF(U16=\"Yes\",K113,0)+LN(U111)*(K117+IF(U10=\"Clearfield\",K119,0)+IF(U14=\"Clay\",K118,0)+U12*K120)+IF(U14=\"Clay\",K116,0)+IF(U10=\"Clearfield\",K114,0)+U12*K115)*U103","v":179.23495496196571},null,{"$f":"(+K112+IF(U16=\"Yes\",K113,0)+LN(W111)*(K117+IF(U10=\"Clearfield\",K119,0)+IF(U14=\"Clay\",K118,0)+U12*K120)+IF(U14=\"Clay\",K116,0)+IF(U10=\"Clearfield\",K114,0)+U12*K115)*U103","v":178.71846374657}]
[113,100,80,2007,31,38,94,0,null,"DCLFIELD",0.95387617661894897,0.59935237500280203,1.5915114653787601,0.11222766173396501]
[114,92.080536912751668,120,2007,31,48,94,0,null,"KSOIL",2.5145317567662698E-2,7.9073504817691407E-3,3.179992796024,1.57907971855337E-3,null,null,"Added Profit in $/acre",null,null,null,{"$f":"+(U113-U8)*U2/2.22-(U111-U6)*U109","v":2.3420798099324087},null,{"$f":"+(W113-U8)*U2/2.22-(W111-U6)*U109","v":1.7273141737387165}]
[115,97.181208053691279,160,2007,31,59,94,0,null,"DCLAY",-3.4884119486487601,1.6463808393911099,-2.1188365809328,3.4675694186571397E-2]
[116,91.58620689655173,0,2008,32,1,125,0,null,"LNK",0.94669112850294701,0.118705368908325,7.9751331991905596,1.38311928799235E-14]
[117,95.724137931034491,40,2008,32,14,125,0,null,"LNK*DCLAY",0.49900023733202897,0.24385593113290899,2.0462911646797601,4.1333966755333698E-2,null,null,"K rate","Exp. Yield"]
[118,98.482758620689665,80,2008,32,31,125,0,null,"LNK*DCLFIELD",-0.14964556390544001,9.1935393442375696E-2,-1.6277252786135701,0.10431391173181299,null,null,0.01,{"$f":"(+$K$112+IF($U$16=\"Yes\",$K$113,0)+LN(Q119)*($K$117+IF($U$10=\"Clearfield\",$K$119,0)+IF($U$14=\"Clay\",$K$118,0)+$U$12*$K$120)+IF($U$14=\"Clay\",$K$116,0)+IF($U$10=\"Clearfield\",$K$114,0)+$U$12*$K$115)*$U$103","v":173.76999974093286}]
[119,96.827586206896555,120,2008,32,41,125,0,null,"LNK*KSOIL",-4.7382158176102699E-3,1.1344859832762E-3,-4.17653094657644,3.5839426616793697E-5,null,null,2,177.98885511581346]
[120,100,160,2008,32,52,125,0,null,null,null,null,null,null,null,null,5,178.71846374657]
[121,89.617486338797804,0,2008,33,2,114,0,null,null,"Effects Specification",null,null,null,null,null,7,178.986384221272]
[122,91.666666666666657,40,2008,33,15,114,0,null,null,null,null,"S.D.  ","Rho  ",null,null,10,179.2703913692435]
[123,87.295081967213108,80,2008,33,32,114,0,null,null,null,null,null,null,null,null,15,179.59324833161969]
[124,98.360655737704917,120,2008,33,42,114,0,null,"Period random",null,null,1.1064707345190701,5.0323337690711199E-2,null,null,30,180.14517595429319]
[125,100,160,2008,33,53,114,0,null,"Idiosyncratic random",null,null,4.8066565925013904,0.94967666230928804,null,null,50,180.55192762267356]
[126,88.41379310344827,0,2008,34,3,87,0,null,null,null,null,null,null,null,null,70,180.81984809737557]
[127,95.724137931034491,40,2008,34,16,87,0,null,null,"Weighted Statistics",null,null,null,null,null,90,181.01996053934292]
[128,98.482758620689665,80,2008,34,33,87,0,null,null,null,null,null,null,null,null,100,181.10385524534706]
[129,96.827586206896555,120,2008,34,43,87,0,null,"R-squared",0.27404288091336698,"    Mean dependent var",null,59.438929627391701,null,null,110,181.17974723831961]
[130,100,160,2008,34,54,87,0,null,"Adjusted R-squared",0.26056803879575002,"    S.D. dependent var",null,9.9541078865655201,null,null,120,181.24903119964026]
[131,100,0,2008,35,4,155,0,null,"S.E. of regression",4.8127962685283698,"    Sum squared resid",null,9983.2564145374308,null,null,130,181.31276626572378]
[132,100,40,2008,35,17,155,0,null,"F-statistic",20.337372306208898,"    Durbin-Watson stat",null,2.37121624282072,null,null,140,181.37177572004907]
[133,98.61351819757364,80,2008,35,34,155,0,null,"Prob(F-statistic)",3.8906473912959599E-26,null,null,null,null,null,150,181.42671220772326]
[134,100,120,2008,35,44,155,0,null,null,null,null,null,null,null,null,160,181.47810185993757]
[135,98.266897746967075,160,2008,35,55,155,0,null,null,"Unweighted Statistics",null,null,null,null,null,170,181.52637501798117]
[136,81.415929203539832,0,2008,38,5,110,0,null,null,null,null,null,null,null,null,180,181.57188816201642]
[137,100,40,2008,38,18,113,0,null,"R-squared",0.27346398363038699,"    Mean dependent var",null,95.920454545454504]
[138,99.705014749262531,80,2008,38,35,113,0,null,"Sum squared resid",10439.6947620644,"    Durbin-Watson stat",null,2.36409625502798]
[139,97.197640117994112,120,2008,38,45,133,0]
[140,100,160,2008,38,56,147,0]
[141,95.5,0,2009,39,1,102,0,null,null,null,null,null,null,null,null,null,null,null,null,null,null,false]
[142,98.333333333333329,45,2009,39,22,102,0,null,{"$f":"0.8301513*2.47105*0.453592","v":0.93047384900780505},null,null,null,null,null,null,"Profit-Maximizing K Rate Calculator for Irrigated Soybeans\nas developed by Dr. M. Popp, Dr. N. Slaton, and Dr. T. Roberts "]
[143,100,90,2009,39,39,102,0]
[144,90.676691729323295,0,2009,42,2,98,0,null,"Dependent Variable: RY",null,null,null,null,null,null,"What is your expected soybean price?",null,null,null,10,{"$f":"IF(W142,CONCATENATE(\"$ kg\",Z155),\"$/bu\")","v":"$/bu"}]
[145,100,60,2009,42,23,98,0,null,"Method: Panel EGLS (Period random effects)"]
[146,88.571428571428569,120,2009,42,41,98,0,null,"Date: 08/10/20   Time: 15:22",null,null,null,null,null,null,"What do you expect to pay for muriate of potash fertilizer?",null,null,null,464.99999999999994,{"$f":"IF(W142,CONCATENATE(\"$ Mg\",Z155),\"$/ton\")","v":"$/ton"},{"$f":"+U147/IF(W142,1000,2000)/IF(W142,0.49809078131038,0.6)","v":0.38750000000000001},{"$f":"IF(W142,CONCATENATE(\"$ kg\",Z155,\" K\"),CONCATENATE(\"$/lb of K\",Z153,\"O\"))","v":"$/lb of K₂O"}]
[147,99.072642967542492,0,2009,43,3,104,0,null,"Sample: 2004 2019"]
[148,100,60,2009,43,24,104,0,null,"Periods included: 16",null,null,null,null,null,null,"What is the yield potential of your field?",null,null,null,65,{"$f":"IF(W142,CONCATENATE(\"kg ha\",Z155),\"bu/acre\")","v":"bu/acre"},{"$f":"+U149/100","v":0.65},"kg ha-1/relative yield % (100% = yield potential)",{"$f":"180*IF(W142,BP172,1)","v":180},"Max. Fert applied per acre in the experiment"]
[149,95.672333848531679,120,2009,43,42,104,0,null,"Cross-sections included: 59",null,null,null,null,null,null,null,null,null,null,null,null,null,null,null,null,null,null,null,null,null,null,null,null,null,null,null,null,null,null,null,null,null,null,null,null,null,null,null,null,null,null,null,null,null,null,null,null,null,null,null,null,null,null,null,null,null,null,null,null,null,null,null,"Labels"]
[150,86.771653543307096,0,2009,44,4,84,0,null,"Total panel (unbalanced) observations: 374",null,null,null,null,null,null,"What is your soil-test K value (STK) and range?",null,null,null,75,{"$f":"IF(W142,CONCATENATE(\"mg K kg\",Z155),\"ppm\")","v":"ppm"},"Soil test range +/-",null,15,null,null,null,null,null,null,null,null,null,null,null,null,null,null,null,null,null,null,null,null,null,null,null,null,null,null,null,null,null,null,null,null,null,null,null,"High",{"$f":"MMULT($BJ$157:$BO$157,BJ160:BJ165)","v":4.1057314425403169E-2},-1.8505632028467103E-4,-3.1330423475564324E-4,5.2347470207984649E-7,-2.1249592933180642E-9,1.3533919202875329E-6,{"$f":"SQRT(MMULT(BJ151:BO151,BR160:BR165))*1.96","v":1.859479488083166},null,null,null,null,null,{"$f":"CONCATENATE(TEXT(T156,0),\" \",BQ154,\" \",TEXT(BP151,\"0.0\"))","v":"96 ± 1.9"}]
[151,92.755905511811022,60,2009,44,25,84,0,null,"Wallace and Hussain estimator of component variances",null,null,null,null,null,null,null,null,null,null,null,null,null,null,null,null,null,null,null,null,null,null,null,null,null,null,null,null,null,null,null,null,null,null,null,null,null,null,null,null,null,null,null,null,null,null,null,null,null,null,"Avg",{"$f":"MMULT($BJ$156:$BO$156,BJ160:BJ165)","v":7.7175135556501073E-2},-3.4804004641094798E-4,-7.8555728681240812E-4,1.7302122112457839E-6,-7.6525032919141685E-9,3.5105648168526295E-6,{"$f":"SQRT(MMULT(BJ152:BO152,BQ160:BQ165))*1.96","v":2.4265397225823353},"95% C.I. of profit maximizing rate at conditional mean",null,null,null,null,{"$f":"CONCATENATE(TEXT(U156,0),\" \",BQ154,\" \",TEXT(BP152,\"0.0\"))","v":"110 ± 2.4"}]
[152,100,120,2009,44,43,84,0,null,"White cross-section standard errors & covariance (d.f. corrected)",null,null,null,null,null,null,"What is your cost to apply fertilizer (equipment, labor, fuel or custom)?",null,null,null,7,{"$f":"IF(W142,CONCATENATE(\"$ ha\",Z155),\"$/acre\")","v":"$/acre"},{"$f":"CONCATENATE(\"...your rate in \",IF(W142,CONCATENATE(\"kg K ha\",Z155),CONCATENATE(\"lbs of K\",Z153,\"O/acre\")),\":\")","v":"...your rate in lbs of K₂O/acre:"},null,{"$f":"(237-1.61*U151)","v":116.24999999999999},"₂",null,null,null,null,null,null,null,null,null,null,null,null,null,null,null,null,null,null,null,null,null,null,null,null,null,null,null,null,null,null,null,null,null,null,"Low",{"$f":"MMULT($BJ$155:$BO$155,BJ160:BJ165)","v":0.11580840054879835},{"$f":"MMULT($BJ$155:$BO$155,BK160:BK165)","v":-5.1963661061194357E-4},-1.2987129840435273E-3,3.0650442311321544E-6,-1.3654051214230862E-8,5.8120297480708631E-6,{"$f":"SQRT(MMULT(BJ153:BO153,BP160:BP165))*1.96","v":3.2223142307492689},null,null,null,null,null,{"$f":"CONCATENATE(TEXT(V156,0),\" \",BQ154,\" \",TEXT(BP153,\"0.0\"))","v":"120 ± 3.2"}]
[153,66.21392190152801,0,2009,45,5,85,0,null,"Variable","Coefficient","Std. Error","t-Statistic","Prob.  ","English",null,{"$f":"CONCATENATE(\"Profit change comparing applying at \",TEXT(ROUND(U156,1),\"0.0\"),IF(W142,CONCATENATE(\" kg K ha\",Z155),CONCATENATE(\"lb K\",Z153,\"O/acre\")),\" to no fertilizer:\")","v":"Profit change comparing applying at 109.6lb K₂O/acre to no fertilizer:"},null,null,null,{"$f":"+U160*$U$145/IF(W142,1,1)-U156*$W$147-IF(U156>0,$U$153)-R165*$U$145/IF(W142,1,1)","v":48.933531083074172},{"$f":"IF(W142,CONCATENATE(\"$ ha\",Z155),\"$/acre\")","v":"$/acre"},"...to your rate:",null,{"$f":"+U162","v":0.20538054240373649},{"$f":"CONCATENATE(\"Fertilizer-K Application Rate (lbs K\",Z153,\"O/acre)\")","v":"Fertilizer-K Application Rate (lbs K₂O/acre)"},null,null,null,null,null,null,null,null,null,null,null,null,null,null,null,null,null,null,null,null,null,null,null,null,null,null,null,null,null,null,null,null,null,null,null,null,null,null,null,null,null,null,"±"]
[154,77.58913412563669,40,2009,45,14,99,0,null,null,null,null,null,null,null,null,null,null,null,{"$f":"CONCATENATE(U151+Y151,\" ppm soil K\")","v":"90 ppm soil K"},{"$f":"CONCATENATE(U151,\" ppm soil K\")","v":"75 ppm soil K"},{"$f":"CONCATENATE(U151-Y151,\" ppm soil K\")","v":"60 ppm soil K"},"K yield max",null,null,"⁻¹",null,null,null,null,null,null,null,null,null,null,null,null,null,null,null,null,null,null,null,null,null,null,null,null,null,null,null,null,null,null,null,null,null,null,"Low",{"$f":"+V156","v":119.60999076659884},{"$f":"+BJ155^2","v":14306.549891185859},{"$f":"+(U151-Y151)*BJ155","v":7176.5994459959302},{"$f":"+(U151-Y151)^2*BJ155","v":430595.9667597558},{"$f":"+(U151-Y151)^2*BK155","v":51503579.608269095},{"$f":"+(U151-Y151)*BK155","v":858392.99347115157}]
[155,83.361629881154514,80,2009,45,31,101,0,null,"C",60.012646834217897,3.5850067279111402,16.739897966435599,4.4292192940741499E-47,59.9358985123718,null,"Profit Maximizing K rate:",null,null,{"$f":"IF((IF(W142,K159,O159)+2*IF(W142,K160,O160)*0.1+IF(W142,K161,O161)*(U151+Y151)+IF(W142,K162,O162)*(U151+Y151)^2+2*IF(W142,K163,O163)*(U151+Y151)^2*0.1+2*IF(W142,K164,O164)*(U151+Y151)*0.1)<0,0,IF(((IF(W142,K159,O159)+2*IF(W142,K160,O160)*Y149+IF(W142,K161,O161)*(U151+Y151)+IF(W142,K162,O162)*(U151+Y151)^2+2*IF(W142,K163,O163)*(U151+Y151)^2*Y149+2*IF(W142,K164,O164)*(U151+Y151)*Y149)*U145/IF(W142,1,1)*W149)>W147,IF(Y149<T188,Y149,T188),IF((W147/(U145/IF(W142,1,1)*W149)-IF(W142,K159,O159)-IF(W142,K161,O161)*(U151+Y151)-IF(W142,K162,O162)*(U151+Y151)^2)/(2*(IF(W142,K160,O160)+IF(W142,K163,O163)*(U151+Y151)^2+IF(W142,K164,O164)*(U151+Y151)))<0,0,IF((W147/(U145/IF(W142,1,1)*W149)-IF(W142,K159,O159)-IF(W142,K161,O161)*(U151+Y151)-IF(W142,K162,O162)*(U151+Y151)^2)/(2*(IF(W142,K160,O160)+IF(W142,K163,O163)*(U151+Y151)^2+IF(W142,K164,O164)*(U151+Y151)))>T188,T188,(W147/(U145/IF(W142,1,1)*W149)-IF(W142,K159,O159)-IF(W142,K161,O161)*(U151+Y151)-IF(W142,K162,O162)*(U151+Y151)^2)/(2*(IF(W142,K160,O160)+IF(W142,K163,O163)*(U151+Y151)^2+IF(W142,K164,O164)*(U151+Y151)))))))","v":95.999872876308686},{"$f":"IF((IF(W142,K159,O159)+2*IF(W142,K160,O160)*0.1+IF(W142,K161,O161)*(U151)+IF(W142,K162,O162)*(U151)^2+2*IF(W142,K163,O163)*(U151)^2*0.1+2*IF(W142,K164,O164)*(U151)*0.1)<0,0,IF(((IF(W142,K159,O159)+2*IF(W142,K160,O160)*Y149+IF(W142,K161,O161)*(U151)+IF(W142,K162,O162)*(U151)^2+2*IF(W142,K163,O163)*(U151)^2*Y149+2*IF(W142,K164,O164)*(U151)*Y149)*U145/IF(W142,1,1)*W149)>W147,IF(Y149<U188,Y149,U188),IF((W147/(U145/IF(W142,1,1)*W149)-IF(W142,K159,O159)-IF(W142,K161,O161)*(U151)-IF(W142,K162,O162)*(U151)^2)/(2*(IF(W142,K160,O160)+IF(W142,K163,O163)*(U151)^2+IF(W142,K164,O164)*(U151)))<0,0,IF((W147/(U145/IF(W142,1,1)*W149)-IF(W142,K159,O159)-IF(W142,K161,O161)*(U151)-IF(W142,K162,O162)*(U151)^2)/(2*(IF(W142,K160,O160)+IF(W142,K163,O163)*(U151)^2+IF(W142,K164,O164)*(U151)))>U188,U188,(W147/(U145/IF(W142,1,1)*W149)-IF(W142,K159,O159)-IF(W142,K161,O161)*(U151)-IF(W142,K162,O162)*(U151)^2)/(2*(IF(W142,K160,O160)+IF(W142,K163,O163)*(U151)^2+IF(W142,K164,O164)*(U151)))))))","v":109.60818873018819},{"$f":"IF((IF(W142,K159,O159)+2*IF(W142,K160,O160)*0.1+IF(W142,K161,O161)*(U151-Y151)+IF(W142,K162,O162)*(U151-Y151)^2+2*IF(W142,K163,O163)*(U151-Y151)^2*0.1+2*IF(W142,K164,O164)*(U151-Y151)*0.1)<0,0,IF(((IF(W142,K159,O159)+2*IF(W142,K160,O160)*Y149+IF(W142,K161,O161)*(U151-Y151)+IF(W142,K162,O162)*(U151-Y151)^2+2*IF(W142,K163,O163)*(U151-Y151)^2*Y149+2*IF(W142,K164,O164)*(U151-Y151)*Y149)*U145/IF(W142,1,1)*W149)>W147,IF(Y149<V188,Y149,V188),IF((W147/(U145/IF(W142,1,1)*W149)-IF(W142,K159,O159)-IF(W142,K161,O161)*(U151-Y151)-IF(W142,K162,O162)*(U151-Y151)^2)/(2*(IF(W142,K160,O160)+IF(W142,K163,O163)*(U151-Y151)^2+IF(W142,K164,O164)*(U151-Y151)))<0,0,IF((W147/(U145/IF(W142,1,1)*W149)-IF(W142,K159,O159)-IF(W142,K161,O161)*(U151-Y151)-IF(W142,K162,O162)*(U151-Y151)^2)/(2*(IF(W142,K160,O160)+IF(W142,K163,O163)*(U151-Y151)^2+IF(W142,K164,O164)*(U151-Y151)))>V188,V188,(W147/(U145/IF(W142,1,1)*W149)-IF(W142,K159,O159)-IF(W142,K161,O161)*(U151-Y151)-IF(W142,K162,O162)*(U151-Y151)^2)/(2*(IF(W142,K160,O160)+IF(W142,K163,O163)*(U151-Y151)^2+IF(W142,K164,O164)*(U151-Y151)))))))","v":119.60999076659884},{"$f":"+U187","v":151.22372315632484},null,null,{"$f":"CONCATENATE(\"Soybean Grain Yield (kg ha\",Z155,\")\")","v":"Soybean Grain Yield (kg ha⁻¹)"},null,null,null,null,null,null,null,null,null,null,null,null,null,null,null,null,null,null,null,null,null,null,null,null,null,null,null,null,null,null,null,null,null,null,"Avg",{"$f":"+U156","v":109.60818873018819},{"$f":"+BJ156^2","v":12013.955036712554},{"$f":"+U151*BJ156","v":8220.6141547641146},{"$f":"U151^2*BJ156","v":616546.06160730857},{"$f":"+U151^2*BK156","v":67578497.081508115},{"$f":"U151*BK156","v":901046.62775344157}]
[156,96.264855687606115,120,2009,45,44,105,0,null,"KSOIL",0.35380876274474699,3.8994920564072097E-2,9.0732012689552199,7.2949979354123303E-18,0.35429950659405102,null,"VMP @ Profit Max:",null,null,{"$f":"IF((K159+2*K160*T156+K161*(U151+Y151)+K162*(U151+Y151)^0.5+2*K163*(U151+Y151)^0.5*T156+2*K164*(U151+Y151)*T156)*U145*W149<0,\"na\",(K159+2*K160*T156+K161*(U151+Y151)+K162*(U151+Y151)^0.5+2*K163*(U151+Y151)^0.5*T156+2*K164*(U151+Y151)*T156)*U145*W149)","v":0.13090861305947118},{"$f":"IF((K159+2*K160*U156+K161*(U151)+K162*(U151)^0.5+2*K163*(U151)^0.5*U156+2*K164*(U151)*U156)*U145*W149<0,\"na\",(K159+2*K160*U156+K161*(U151)+K162*(U151)^0.5+2*K163*(U151)^0.5*U156+2*K164*(U151)*U156)*U145*W149)","v":0.20643039748201014},{"$f":"IF((K159+2*K160*V156+K161*(U151-Y151)+K162*(U151-Y151)^0.5+2*K163*(U151-Y151)^0.5*V156+2*K164*(U151-Y151)*V156)*U145*W149<0,\"na\",(K159+2*K160*V156+K161*(U151-Y151)+K162*(U151-Y151)^0.5+2*K163*(U151-Y151)^0.5*V156+2*K164*(U151-Y151)*V156)*U145*W149)","v":0.23496111099931505},null,null,null,{"$f":"CONCATENATE(\"Fertilizer-K Application Rate (kg K ha\",Z155,\")\")","v":"Fertilizer-K Application Rate (kg K ha⁻¹)"},null,null,null,null,null,null,null,null,null,null,null,null,null,null,null,null,null,null,null,null,null,null,null,null,null,null,null,null,null,null,null,null,null,null,"High",{"$f":"+T156","v":95.999872876308686},{"$f":"+BJ157^2","v":9215.9755922674285},{"$f":"+(U151+Y151)*BJ157","v":8639.9885588677826},{"$f":"+(U151+Y151)^2*BJ157","v":777598.97029810038},{"$f":"+(U151+Y151)^2*BK157","v":74649402.297366172},{"$f":"(U151+Y151)*BK157","v":829437.80330406851}]
[157,100,160,2009,45,52,123,0,null,"KSOIL^2",-7.6151532822393299E-4,1.07035553953881E-4,-7.11460164490809,5.9752268274607904E-12,-7.6264977645771302E-4,null,"UAEX recommendation:",null,null,{"$f":"IF((237-1.61*(U151+Y151))*0.930509090050236<0,0,(237-1.61*(U151+Y151))*0.930509090050236)","v":85.699887193626722},{"$f":"+Y153","v":116.24999999999999},{"$f":"IF((237-1.61*(U151-Y151))*0.930509090050236<0,0,(237-1.61*(U151-Y151))*0.930509090050236)","v":130.6434762430531},null,null,null,null,null,null,null,null,null,null,null,null,null,null,null,null,null,null,null,null,null,null,null,null,null,null,null,null,null,null,null,null,null,null,null,null,null,null,null,"Coefficient Covariance Matrix as available in Eviews under the View Menu in the Equation Editor"]
[158,76.823338735818467,0,2009,46,6,81,0,null,"MKRATE",0.55842226243974302,8.9321623534139097E-2,6.2518149619874697,1.1335414447456799E-9,0.51558809203730405,null,null,null,null,{"$f":"+T156-T158","v":10.299985682681964},{"$f":"+U156-U158","v":-6.6418112698117966},{"$f":"+V156-V158","v":-11.03348547645426},"Est. Yield Max",null,null,null,null,null,null,null,null,null,null,null,null,null,null,null,null,null,null,null,null,null,null,null,null,null,null,null,null,null,null,null,null,null,null,null,null,null,null,"K","K^2","S*K","S^2*K","S^2*K^2","S*K^2","Low","Avg","High",null,null,null,null,"English"]
[159,86.547811993517016,40,2009,46,15,94,0,null,"MKRATE^2",-1.89554897065829E-3,4.43859798457153E-4,-4.2706029634744596,2.4892107600856801E-5,-1.6110248193303999E-3,null,"Est. Yield at Profit-Max K:",null,null,{"$f":"IF((+K156+K157*(U151+Y151)+K158*(U151+Y151)^2+IF(W142,K159,O159)*T156+IF(W142,K160,O160)*T156^2+IF(W142,K161,O161)*(U151+Y151)*T156+IF(W142,K162,O162)*(U151+Y151)^2*T156+IF(W142,K163,O163)*(U151+Y151)^2*T156^2+IF(W142,K164,O164)*(U151+Y151)*T156^2)*W149>U149,U149,(+K156+K157*(U151+Y151)+K158*(U151+Y151)^2+IF(W142,K159,O159)*T156+IF(W142,K160,O160)*T156^2+IF(W142,K161,O161)*(U151+Y151)*T156+IF(W142,K162,O162)*(U151+Y151)^2*T156+IF(W142,K163,O163)*(U151+Y151)^2*T156^2+IF(W142,K164,O164)*(U151+Y151)*T156^2)*W149)","v":62.883559207798648},{"$f":"IF((+K156+K157*U151+K158*U151^2+IF(W142,K159,O159)*U156+IF(W142,K160,O160)*U156^2+IF(W142,K161,O161)*U151*U156+IF(W142,K162,O162)*U151^2*U156+IF(W142,K163,O163)*U151^2*U156^2+IF(W142,K164,O164)*(U151)*U156^2)*W149>U149,U149,(+K156+K157*U151+K158*U151^2+IF(W142,K159,O159)*U156+IF(W142,K160,O160)*U156^2+IF(W142,K161,O161)*U151*U156+IF(W142,K162,O162)*U151^2*U156+IF(W142,K163,O163)*U151^2*U156^2+IF(W142,K164,O164)*(U151)*U156^2)*W149)","v":63.312777628831505},{"$f":"IF((+K156+K157*(U151-Y151)+K158*(U151-Y151)^2+IF(W142,K159,O159)*V156+IF(W142,K160,O160)*V156^2+IF(W142,K161,O161)*(U151-Y151)*V156+IF(W142,K162,O162)*(U151-Y151)^2*V156+IF(W142,K163,O163)*(U151-Y151)^2*V156^2+IF(W142,K164,O164)*(U151-Y151)*V156^2)*W149>U149,U149,(+K156+K157*(U151-Y151)+K158*(U151-Y151)^2+IF(W142,K159,O159)*V156+IF(W142,K160,O160)*V156^2+IF(W142,K161,O161)*(U151-Y151)*V156+IF(W142,K162,O162)*(U151-Y151)^2*V156+IF(W142,K163,O163)*(U151-Y151)^2*V156^2+IF(W142,K164,O164)*(U151-Y151)*V156^2)*W149)","v":63.727673337962528},{"$f":"IF((+K156+K157*U151+K158*U151^2+IF(W142,K159,O159)*W156+IF(W142,K160,O160)*W156^2+IF(W142,K161,O161)*U151*W156+IF(W142,K162,O162)*U151^2*W156+IF(W142,K163,O163)*U151^2*W156^2+IF(W142,K164,O164)*(U151)*W156^2)*W149>U149,U149,(+K156+K157*U151+K158*U151^2+IF(W142,K159,O159)*W156+IF(W142,K160,O160)*W156^2+IF(W142,K161,O161)*U151*W156+IF(W142,K162,O162)*U151^2*W156+IF(W142,K163,O163)*U151^2*W156^2+IF(W142,K164,O164)*(U151)*W156^2)*W149)","v":64.119078608337887},null,null,null,null,null,null,null,null,null,null,null,null,null,null,null,null,null,null,null,null,null,null,null,null,null,null,null,null,null,null,null,null,null,null,null,null,null,"KRATE",{"$f":"IF($W$142,BU167,BU160)","v":6.1536239778055002E-3},{"$f":"IF($W$142,BV167,BV160)","v":-2.9024437152184001E-5},-7.7739773599836394E-5,1.9866945157436199E-7,-9.3921804907638397E-10,3.6783512576113802E-7,{"$f":"+BJ155","v":119.60999076659884},{"$f":"+BJ156","v":109.60818873018819},{"$f":"+BJ157","v":95.999872876308686},null,null,6.1536239778055002E-3,-2.9024437152184001E-5,-7.7739773599836394E-5,1.9866945157436199E-7,-9.3921804907638397E-10,3.6783512576113802E-7]
[160,94.813614262560776,80,2009,46,32,98,0,null,"KSOIL*MKRATE",-5.1504553294774496E-3,9.8725290114671811E-4,-5.2169563882720098,3.0560272350604698E-7,-4.7579423357917002E-3,null,"Est. Yield at UAEX rec.:",null,null,{"$f":"IF((+K156+K157*(U151+Y151)+K158*(U151+Y151)^2+IF(W142,K159,O159)*T158+IF(W142,K160,O160)*T158^2+IF(W142,K161,O161)*(U151+Y151)*T158+IF(W142,K162,O162)*(U151+Y151)^2*T158+IF(W142,K163,O163)*(U151+Y151)^2*T158^2+IF(W142,K164,O164)*(U151+Y151)*T158^2)*W149>U149,U149,(+K156+K157*(U151+Y151)+K158*(U151+Y151)^2+IF(W142,K159,O159)*T158+IF(W142,K160,O160)*T158^2+IF(W142,K161,O161)*(U151+Y151)*T158+IF(W142,K162,O162)*(U151+Y151)^2*T158+IF(W142,K163,O163)*(U151+Y151)^2*T158^2+IF(W142,K164,O164)*(U151+Y151)*T158^2)*W149)","v":62.444525435720742},{"$f":"IF((+K156+K157*U151+K158*U151^2+IF(W142,K159,O159)*U158+IF(W142,K160,O160)*U158^2+IF(W142,K161,O161)*U151*U158+IF(W142,K162,O162)*U151^2*U158+IF(W142,K163,O163)*U151^2*U158^2+IF(W142,K164,O164)*(U151)*U158^2)*W149>U149,U149,(+K156+K157*U151+K158*U151^2+IF(W142,K159,O159)*U158+IF(W142,K160,O160)*U158^2+IF(W142,K161,O161)*U151*U158+IF(W142,K162,O162)*U151^2*U158+IF(W142,K163,O163)*U151^2*U158^2+IF(W142,K164,O164)*(U151)*U158^2)*W149)","v":63.549609761296338},{"$f":"IF((+K156+K157*(U151-Y151)+K158*(U151-Y151)^2+IF(W142,K159,O159)*V158+IF(W142,K160,O160)*V158^2+IF(W142,K161,O161)*(U151-Y151)*V158+IF(W142,K162,O162)*(U151-Y151)^2*V158+IF(W142,K163,O163)*(U151-Y151)^2*V158^2+IF(W142,K164,O164)*(U151-Y151)*V158^2)*W149>U149,U149,(+K156+K157*(U151-Y151)+K158*(U151-Y151)^2+IF(W142,K159,O159)*V158+IF(W142,K160,O160)*V158^2+IF(W142,K161,O161)*(U151-Y151)*V158+IF(W142,K162,O162)*(U151-Y151)^2*V158+IF(W142,K163,O163)*(U151-Y151)^2*V158^2+IF(W142,K164,O164)*(U151-Y151)*V158^2)*W149)","v":64.086568644763972},null,null,null,null,null,null,null,null,null,null,null,null,null,null,null,null,null,null,null,null,null,null,null,null,null,null,null,null,null,null,null,null,null,null,null,null,null,null,"KRATE^2",{"$f":"IF($W$142,BU168,BU161)","v":-2.9024437152184001E-5},1.4181027444729699E-7,3.6810214316442001E-7,-9.41566112133928E-10,4.6200386190833198E-12,-1.80695243587286E-9,{"$f":"+BK155","v":14306.549891185859},{"$f":"+BK156","v":12013.955036712554},{"$f":"+BK157","v":9215.9755922674285},null,null,-2.9024437152184001E-5,1.4181027444729699E-7,3.6810214316442001E-7,-9.41566112133928E-10,4.6200386190833198E-12,-1.80695243587286E-9]
[161,96.758508914100489,120,2009,46,45,105,0,null,"KSOIL^2*MKRATE",1.1141668951509501E-5,2.5283379220850499E-6,4.4067167027741796,1.38157291760444E-5,1.0291498387051499E-5,null,"Added Profit in $/acre",null,null,{"$f":"+(T160-T161)*U145/IF(W142,1,1)-(T156-T158)*W147-IF(T158=0,IF(T156=0,0,U153),IF(T156=0,IF(T158>0,-U153,0)))","v":0.39909326873979722},{"$f":"+(U160-U161)*U145/IF(W142,1,1)-(U156-U158)*W147-IF(U158=0,IF(U156=0,0,U153),IF(U156=0,IF(U158>0,-U153,0)))","v":0.20538054240373649},{"$f":"+(V160-V161)*U145/IF(W142,1,1)-(V156-V158)*W147-IF(V158=0,IF(V156=0,0,U153),IF(V156=0,IF(V158>0,-U153,0)))","v":0.68652255411159224},{"$f":"+(U160-W160)*U145/IF(W142,1,1)-(U156-W156)*W147-IF(W156=0,IF(U156=0,0,U153),IF(U156=0,IF(W156>0,-U153,0)))","v":8.0630097950641328},null,null,null,null,null,null,null,null,null,null,null,null,null,null,null,null,null,null,null,null,null,null,null,null,null,null,null,null,null,null,null,null,null,null,null,null,null,"KSOIL*KRATE",-7.7739773599836394E-5,3.6810214316442001E-7,1.0586484601747901E-6,-2.8436750919075199E-9,1.36074160025652E-11,-5.0564049935304302E-9,{"$f":"+BL155","v":7176.5994459959302},{"$f":"+BL156","v":8220.6141547641146},{"$f":"+BL157","v":8639.9885588677826},null,null,-7.7739773599836394E-5,3.6810214316442001E-7,1.0586484601747901E-6,-2.8436750919075199E-9,1.36074160025652E-11,-5.0564049935304302E-9]
[162,100,160,2009,46,53,115,0,null,"KSOIL^2*MKRATE^2",-3.6144016755734397E-8,1.18428109096737E-8,-3.0519795537907499,2.4398686229282298E-3,-3.0692137304910899E-8,null,"Yield change:",null,null,{"$f":"+T161-T160","v":-0.43903377207790584},{"$f":"+U161-U160","v":0.23683213246483348},{"$f":"+V161-V160","v":0.35889530680144333},{"$f":"+W160-U160","v":0.80630097950638202},null,null,null,null,null,null,null,null,null,null,null,null,null,null,null,null,null,null,null,null,null,null,null,null,null,null,null,null,null,null,null,null,null,null,null,null,null,"KSOIL^2*KRATE",1.9866945157436199E-7,-9.41566112133928E-10,-2.8436750919075199E-9,8.1147235349979903E-12,-3.9052920474510102E-14,1.3627639872428901E-11,{"$f":"+BM155","v":430595.9667597558},{"$f":"+BM156","v":616546.06160730857},{"$f":"+BM157","v":777598.97029810038},null,null,1.9866945157436199E-7,-9.41566112133928E-10,-2.8436750919075199E-9,8.1147235349979903E-12,-3.9052920474510102E-14,1.3627639872428901E-11]
[163,78.633975481611202,0,2010,47,1,73,0,null,"KSOIL*MKRATE^2",1.6734024493666399E-5,4.7926306173670203E-6,3.4916157387609599,5.38950641734268E-4,1.42320599518323E-5,null,"K rate",{"$f":"CONCATENATE(\"Est. Yield (STK = \",U151,\")\")","v":"Est. Yield (STK = 75)"},{"$f":"CONCATENATE(\"Est. Yield (STK = \",U151-Y151,\")\")","v":"Est. Yield (STK = 60)"},{"$f":"CONCATENATE(\"Est. Yield (STK = \",U151+Y151,\")\")","v":"Est. Yield (STK = 90)"},null,null,null,null,null,null,"Year","Potash Fertilizer Price in $/ton","Soybean Price in $/bu","Soybean Yield in bu/acre","$/kg Ps","$/Mg K","Y in kg/ha",null,"$/kg K",null,null,null,null,null,null,null,null,null,null,null,null,null,null,null,null,null,null,null,null,null,null,null,null,null,"KSOIL^2*KRATE^2",-9.3921804907638397E-10,4.6200386190833198E-12,1.36074160025652E-11,-3.9052920474510102E-14,1.9626421865426099E-16,-6.7985475641129305E-14,{"$f":"+BN155","v":51503579.608269095},{"$f":"+BN156","v":67578497.081508115},{"$f":"+BN157","v":74649402.297366172},null,null,-9.3921804907638397E-10,4.6200386190833198E-12,1.36074160025652E-11,-3.9052920474510102E-14,1.9626421865426099E-16,-6.7985475641129305E-14]
[164,95.796847635726806,45,2010,47,22,73,0,null,null,null,null,null,null,null,null,0,{"$f":"IF((+$K$156+$K$157*$U$151+$K$158*$U$151^2+$K$159*Q165+$K$160*Q165^2+$K$161*$U$151*Q165+$K$162*$U$151^2*Q165+$K$163*$U$151^2*Q165^2+$K$164*$U$151*Q165^2)*$W$149>$U$149,$U$149,(+$K$156+$K$157*$U$151+$K$158*$U$151^2+$K$159*Q165+$K$160*Q165^2+$K$161*$U$151*Q165+$K$162*$U$151^2*Q165+$K$163*$U$151^2*Q165^2+$K$164*$U$151*Q165^2)*$W$149)","v":53.472107207229293},{"$f":"IF((+$K$156+$K$157*($U$151-$Y$151)+$K$158*($U$151-$Y$151)^2+$K$159*Q165+$K$160*Q165^2+$K$161*($U$151-$Y$151)*Q165+$K$162*($U$151-$Y$151)^2*Q165+$K$163*($U$151-$Y$151)^2*Q165^2+$K$164*($U$151-$Y$151)*Q165^2)*$W$149>$U$149,$U$149,(+$K$156+$K$157*($U$151-$Y$151)+$K$158*($U$151-$Y$151)^2+$K$159*Q165+$K$160*Q165^2+$K$161*($U$151-$Y$151)*Q165+$K$162*($U$151-$Y$151)^2*Q165+$K$163*($U$151-$Y$151)^2*Q165^2+$K$164*($U$151-$Y$151)*Q165^2)*$W$149)","v":51.024816321242767},{"$f":"IF((+$K$156+$K$157*($U$151+$Y$151)+$K$158*($U$151+$Y$151)^2+$K$159*Q165+$K$160*Q165^2+$K$161*($U$151+$Y$151)*Q165+$K$162*($U$151+$Y$151)^2*Q165+$K$163*($U$151+$Y$151)^2*Q165^2+$K$164*($U$151+$Y$151)*Q165^2)*$W$149>$U$149,$U$149,(+$K$156+$K$157*($U$151+$Y$151)+$K$158*($U$151+$Y$151)^2+$K$159*Q165+$K$160*Q165^2+$K$161*($U$151+$Y$151)*Q165+$K$162*($U$151+$Y$151)^2*Q165+$K$163*($U$151+$Y$151)^2*Q165^2+$K$164*($U$151+$Y$151)*Q165^2)*$W$149)","v":55.696654859710328},{"$f":"ROUNDUP((MAX(BJ175:BJ548,U149)+IF(W142,500,10))/10,0)*10","v":80},null,null,null,null,null,2009,{"$f":"26.1*20","v":522},9.66,39,{"$f":"+AC165/60*2204.62/1000","v":0.35494382000000002},{"$f":"+AB165/2000*2204","v":575.24400000000003},{"$f":"+(AD165*60*0.4536)*2.4711","v":2622.8848463999998},null,{"$f":"+AF165/1000/0.49809078131038","v":1.1548979053309216},null,null,null,null,null,null,null,null,{"$f":"CONCATENATE(\"Obs. Yields (\",U151-Y151,\" < STK < \",U151+Y151,\")\")","v":"Obs. Yields (60 < STK < 90)"},null,null,null,null,null,null,null,null,null,null,null,null,null,null,null,null,"KSOIL*KRATE^2",3.6783512576113802E-7,-1.80695243587286E-9,-5.0564049935304302E-9,1.3627639872428901E-11,-6.7985475641129305E-14,2.51490994891945E-11,{"$f":"+BO155","v":858392.99347115157},{"$f":"+BO156","v":901046.62775344157},{"$f":"+BO157","v":829437.80330406851},null,null,3.6783512576113802E-7,-1.80695243587286E-9,-5.0564049935304302E-9,1.3627639872428901E-11,-6.7985475641129305E-14,2.51490994891945E-11]
[165,100,90,2010,47,39,73,0,null,null,"Effects Specification",null,null,null,null,null,2,{"$f":"IF((+$K$156+$K$157*$U$151+$K$158*$U$151^2+$K$159*Q166+$K$160*Q166^2+$K$161*$U$151*Q166+$K$162*$U$151^2*Q166+$K$163*$U$151^2*Q166^2+$K$164*$U$151*Q166^2)*$W$149>$U$149,$U$149,(+$K$156+$K$157*$U$151+$K$158*$U$151^2+$K$159*Q166+$K$160*Q166^2+$K$161*$U$151*Q166+$K$162*$U$151^2*Q166+$K$163*$U$151^2*Q166^2+$K$164*$U$151*Q166^2)*$W$149)","v":53.775166309192315},{"$f":"IF((+$K$156+$K$157*($U$151-$Y$151)+$K$158*($U$151-$Y$151)^2+$K$159*Q166+$K$160*Q166^2+$K$161*($U$151-$Y$151)*Q166+$K$162*($U$151-$Y$151)^2*Q166+$K$163*($U$151-$Y$151)^2*Q166^2+$K$164*($U$151-$Y$151)*Q166^2)*$W$149>$U$149,$U$149,(+$K$156+$K$157*($U$151-$Y$151)+$K$158*($U$151-$Y$151)^2+$K$159*Q166+$K$160*Q166^2+$K$161*($U$151-$Y$151)*Q166+$K$162*($U$151-$Y$151)^2*Q166+$K$163*($U$151-$Y$151)^2*Q166^2+$K$164*($U$151-$Y$151)*Q166^2)*$W$149)","v":51.398516529908726},{"$f":"IF((+$K$156+$K$157*($U$151+$Y$151)+$K$158*($U$151+$Y$151)^2+$K$159*Q166+$K$160*Q166^2+$K$161*($U$151+$Y$151)*Q166+$K$162*($U$151+$Y$151)^2*Q166+$K$163*($U$151+$Y$151)^2*Q166^2+$K$164*($U$151+$Y$151)*Q166^2)*$W$149>$U$149,$U$149,(+$K$156+$K$157*($U$151+$Y$151)+$K$158*($U$151+$Y$151)^2+$K$159*Q166+$K$160*Q166^2+$K$161*($U$151+$Y$151)*Q166+$K$162*($U$151+$Y$151)^2*Q166+$K$163*($U$151+$Y$151)^2*Q166^2+$K$164*($U$151+$Y$151)*Q166^2)*$W$149)","v":55.935548442807459},{"$f":"ROUNDDOWN((S165-IF(W142,500,10))/10,0)*10","v":40},null,null,null,null,null,2010,{"$f":"23*20","v":460},10.9,39.5,{"$f":"+AC166/60*2204.62/1000","v":0.40050596666666666},{"$f":"+AB166/2000*2204","v":506.92},{"$f":"+(AD166*60*0.4536)*2.4711","v":2656.5115751999997},null,{"$f":"+AF166/1000/0.49809078131038","v":1.0177261234716934},null,null,null,null,null,null,null,null,{"$f":"CONCATENATE(\"Estimated Yield Response to K Fertilizer and Profit-Maximizing Application Rates for a Range of Initial Soil-Test K Values (STK) at Specified Yield Potential\")","v":"Estimated Yield Response to K Fertilizer and Profit-Maximizing Application Rates for a Range of Initial Soil-Test K Values (STK) at Specified Yield Potential"},null,null,null,null,null,null,null,null,null,null,null,null,null,null,null,null,null,null,null,null,null,null,null,null,null,null,null,null,null,null,"Metric"]
[166,92.925430210325061,0,2010,49,2,73,0,null,null,null,null,"S.D.  ","Rho  ",null,null,5,54.221527841664987,51.949105989784414,56.287236847759146,null,null,null,null,null,null,2011,{"$f":"29.19*20","v":583.80000000000007},12.3,42.2,0.45194710000000005,643.34760000000006,2838.0959107200001,null,1.2916271975712492,null,null,null,null,null,null,null,null,null,null,null,null,null,null,null,null,null,null,null,null,null,null,null,null,null,null,null,null,null,null,null,null,null,null,null,null,null,7.9783524307744692E-3,-3.9147221946138398E-5,-8.5426036346039397E-5,1.8885514744196801E-7,-8.3829888032455503E-10,4.07930943419101E-7]
[167,98.470363288718929,40,2010,49,14,109,0,null,null,null,null,null,null,null,null,7,54.513617449665517,52.309525060952687,56.517261137930923,null,null,null,null,null,null,2012,{"$f":"29.8*20","v":596},14.3,48.3,0.52543443333333339,656.79199999999992,3248.3420020799995,null,1.318619064324194,null,null,null,null,null,null,null,null,null,null,null,null,null,null,null,null,null,null,null,null,null,null,null,null,null,null,null,null,null,null,null,null,null,null,null,null,null,-3.9147221946138398E-5,1.9701152068642401E-7,4.1633775021770899E-7,-8.8552168979003296E-10,4.0034776105752602E-12,-2.03763864577607E-9]
[168,100,80,2010,49,31,115,0,null,"Period random",null,null,1.10111092184302,4.9821492583029002E-2,null,null,10,54.943524741194437,52.840192814581883,56.855645603494594,null,null,null,null,null,null,2013,{"$f":"23.75*20","v":475},13.1,46.4,0.48134203333333331,523.44999999999993,3120.5604326399998,null,1.0509128448892486,null,null,null,null,null,null,null,null,null,null,null,null,null,null,null,null,null,null,null,null,null,null,null,null,null,null,null,null,null,null,null,null,null,null,null,null,null,-8.5426036346039397E-5,4.1633775021770899E-7,9.7466829082261206E-7,-2.3189121915404699E-9,1.0556736560231799E-11,-4.6614994049802997E-9]
[169,93.307839388145325,120,2010,49,41,142,0,null,"Idiosyncratic random",null,null,4.8086736584616503,0.95017850741697096,null,null,15,55.638097905817673,53.698076795635195,57.40188112691667,null,null,null,null,null,null,2014,{"$f":"23.6*20","v":472},10.6,51.9,0.38948286666666665,520.14400000000001,3490.4544494400002,null,1.0442755006057376,null,null,null,null,null,null,null,null,null,null,null,null,null,null,null,null,null,null,null,null,null,null,null,null,null,null,null,null,null,null,null,null,null,null,null,null,null,1.8885514744196801E-7,-8.8552168979003296E-10,-2.3189121915404699E-9,6.3924926482533503E-12,-2.9291051090538602E-14,1.0767906563634501E-11]
[170,96.940726577437871,160,2010,49,52,151,0,null,null,null,null,null,null,null,null,30,57.55727499024988,56.072511676330123,58.907548303302704,null,null,null,null,null,null,2015,{"$f":"21.27*20","v":425.4},9.4600000000000009,51.4,0.34759508666666666,468.79079999999999,3456.8277206399998,null,0.941175419401866,null,null,null,null,null,null,null,null,null,null,null,null,null,null,null,null,null,null,null,null,null,null,null,null,null,null,null,null,null,null,null,null,null,null,null,null,null,-8.3829888032455503E-10,4.0034776105752602E-12,1.0556736560231799E-11,-2.9291051090538602E-14,1.4025217024228701E-16,-5.0563826762968099E-14]
[171,74.324324324324323,0,2011,51,1,167,0,null,null,"Weighted Statistics",null,null,null,null,null,45,59.229638460525941,58.148120963327564,60.213656388868436,null,null,null,null,null,null,2016,{"$f":"16.97*20","v":339.4},9.83,50,0.36119024333333327,374.0188,3362.6728799999996,null,0.75090488327454941,null,null,null,null,null,null,null,null,null,null,null,null,null,null,null,null,null,null,null,null,null,null,null,null,null,null,null,null,null,null,null,null,0.93050909005023585,"convert lbs of K20/acre to kg K ha-1",null,null,null,4.07930943419101E-7,-2.03763864577607E-9,-4.6614994049802997E-9,1.0767906563634501E-11,-5.0563826762968099E-14,2.2969308234523799E-11]
[172,91.891891891891902,40,2011,51,14,57,0,null,null,null,null,null,null,null,null,60,60.65518831664582,59.924904656627504,61.320205383613853,null,null,null,null,null,null,2017,{"$f":"18.98*20","v":379.6},9.77,52.9,0.35898562333333328,418.31920000000008,3557.70790704,null,0.83984529667359753,null,null,null,null,null,null,null,null,null,null,null,null,null,null,null,null,null,null,null,null,null,null,null,null,null,null,"Actual RelYld Obs Converted to Yield",null,null,null,"Min Yield"]
[173,95.945945945945937,80,2011,51,31,63,0,null,"R-squared",0.60175761777646097,"    Mean dependent var",null,61.926727049257799,null,null,75,61.833924558609546,61.40286275622995,62.22719528753899,null,null,null,null,null,null,2018,{"$f":"20*20","v":400},8.81,53.2,0.32371170333333332,440.8,3577.88394432,null,0.88497923780147258,null,null,null,null,null,null,null,null,null,null,null,null,null,null,null,null,null,null,null,null,null,null,null,null,null,"RelYld","Yield","Krate","Ksoil",null,{"$f":"MIN(BN175:BN548)","v":39.493670886076004},null,"Mkrate"]
[174,98.648648648648646,120,2011,51,41,72,0,null,"Adjusted R-squared",0.59302901761813698,"    S.D. dependent var",null,8.5587215788764102,null,null,90,62.765847186417112,62.581995262134903,62.93462610064379,null,null,null,null,null,null,"Avg.",{"$f":"AVERAGE($AB$165:$AB$174)","v":465.32000000000005},{"$f":"AVERAGE($AC$165:$AC$174)","v":10.872999999999999},{"$f":"AVERAGE($AD$165:$AD$174)","v":47.48},{"$f":"+AC175/60*2204.62/1000","v":0.39951388766666662},512.78264000000013,{"$f":"+(AD175*60*0.4536)*2.4711","v":3193.1941668479994},null,1.0294963473344534,null,null,null,null,null,null,null,null,null,null,null,null,null,null,null,null,null,null,null,null,null,null,null,null,null,{"$f":"_xlfn.NUMBERVALUE(IF(AND($G2>=($U$151-$Y$151),$G2<=($U$151+$Y$151)),B2,\"\"))","v":0},{"$f":"_xlfn.NUMBERVALUE(IFERROR(+BI175*$W$149,\"\"))","v":0},{"$f":"_xlfn.NUMBERVALUE(IF(AND($G2>=($U$151-$Y$151),$G2<=($U$151+$Y$151)),C2,\"\"))","v":0},{"$f":"_xlfn.NUMBERVALUE(IF(AND($G2>=($U$151-$Y$151),$G2<=($U$151+$Y$151)),G2,\"\"))","v":0},null,{"$f":"IF(BJ175=0,999,BJ175)","v":999},null,{"$f":"+BK175*$BP$172","v":0}]
[175,100,160,2011,51,52,83,0,null,"S.E. of regression",4.8098059248779101,"    Sum squared resid",null,8443.9950577716099,null,null,105,63.450956200068525,63.462302174342376,63.442497822928303,null,null,null,null,null,null,"Min.",{"$f":"MIN($AB$165:$AB$174)","v":339.4},{"$f":"MIN($AC$165:$AC$174)","v":8.81},{"$f":"MIN($AD$165:$AD$174)","v":39},null,null,null,null,null,null,null,null,null,null,null,null,null,null,null,null,null,null,null,null,null,null,null,null,null,null,null,null,null,null,{"$f":"_xlfn.NUMBERVALUE(IF(AND($G3>=($U$151-$Y$151),$G3<=($U$151+$Y$151)),B3,\"\"))","v":0},{"$f":"_xlfn.NUMBERVALUE(IFERROR(+BI176*$W$149,\"\"))","v":0},{"$f":"_xlfn.NUMBERVALUE(IF(AND($G3>=($U$151-$Y$151),$G3<=($U$151+$Y$151)),C3,\"\"))","v":0},{"$f":"_xlfn.NUMBERVALUE(IF(AND($G3>=($U$151-$Y$151),$G3<=($U$151+$Y$151)),G3,\"\"))","v":0},null,{"$f":"IF(BJ176=0,999,BJ176)","v":999},null,{"$f":"+BK176*$BP$172","v":0}]
[176,89.65517241379311,0,2011,53,2,89,0,null,"F-statistic",68.940907689830098,"    Durbin-Watson stat",null,1.92390319553045,null,null,120,63.889251599563771,64.043783492852356,63.750810454392514,null,null,null,null,null,null,"Max.",{"$f":"MAX($AB$165:$AB$174)","v":596},{"$f":"MAX($AC$165:$AC$174)","v":14.3},{"$f":"MAX($AD$165:$AD$174)","v":53.2},null,null,null,null,null,null,null,null,null,null,null,null,null,null,null,null,null,null,null,null,null,null,null,null,null,null,null,null,null,null,0,0,0,0,null,999,null,0]
[177,98.275862068965509,40,2011,53,15,113,0,null,"Prob(F-statistic)",2.4530793303282301E-68,null,null,null,null,null,135,64.080733384902828,64.326439217664827,63.859563995036396,null,null,null,null,null,null,null,null,null,null,null,null,null,null,null,null,null,null,null,null,null,null,null,null,null,null,null,null,null,null,null,null,null,null,null,null,null,null,null,null,0,0,0,0,null,999,null,0]
[178,100,80,2011,53,32,120,0,null,null,null,null,null,null,null,null,150,64.025401556085754,64.310269348779826,63.768758444859998,null,null,null,null,null,null,null,null,null,null,null,null,null,null,null,null,null,null,null,null,null,null,null,null,null,null,null,null,null,null,null,null,null,null,null,null,null,null,null,null,0,0,0,0,null,999,null,0]
[179,94.827586206896555,120,2011,53,42,126,0,null,null,"Unweighted Statistics",null,null,null,null,null,165,63.723256113112512,63.995273886197317,63.478393803863291,null,null,null,null,null,null,null,null,null,null,null,null,null,null,null,null,null,null,null,null,null,null,null,null,null,null,null,null,null,null,null,null,null,null,null,null,null,null,null,null,77.508650519031093,50.380622837370197,0,85,null,50.380622837370197,null,0]
[180,93.103448275862064,160,2011,53,53,143,0,null,null,null,null,null,null,null,null,180,63.174297055983104,63.381452829917315,62.988470072046248,null,null,null,null,null,null,null,null,null,null,null,null,null,null,null,null,null,null,null,null,null,null,null,null,null,null,null,null,null,null,null,null,null,null,null,null,null,null,null,null,82.525951557093407,53.641868512110698,30,86,null,53.641868512110698,null,27.915272701507075]
[181,92.063492063492063,0,2012,57,1,164,0,null,"R-squared",0.59781372282832701,"    Mean dependent var",null,93.900802139037395,null,null,null,53.472107207229293,51.024816321242767,55.696654859710328,null,null,null,null,null,null,null,null,null,null,null,null,null,null,null,null,null,null,null,null,null,null,null,null,null,null,null,null,null,null,null,null,null,null,null,null,null,null,null,null,100,65,60,85,null,65,null,55.830545403014149]
[182,98.412698412698404,40,2012,57,14,105,0,null,null,null,null,null,null,null,null,null,53.472107207229293,51.024816321242767,55.696654859710328,null,null,null,null,null,null,null,null,null,null,null,null,null,null,null,null,null,null,null,null,null,null,null,null,null,null,null,null,null,null,null,null,null,null,null,null,null,null,null,null,99.307958477508606,64.550173010380604,90,89,null,64.550173010380604,null,83.74581810452122]
[183,100,80,2012,57,31,126,0,null,"Sum squared resid",8871.07490300881,"    Durbin-Watson stat",null,1.8766356706567,null,null,"Disclaimer:  This software is provided ‘as is’ and without warranties as to performance or merchantability. Further, statements may have been made to you about this software, and they do not constitute warranties and shall not be relied upon by the user to use the program or act on its results. This program is provided without any expressed or implied warranties whatsoever. Because the diversity of conditions and hardware under which this program may be used, no warranty of merchantability or warranty of fitness for a particular purpose is offered. The user is advised to test the program thoroughly before relying on it. The user assumes the entire risk of using the program. The authors will not be liable for any claim or damage brought against the user by any third party, nor will the authors be liable for any consequential, indirect, or special damages suffered by the user as a result of the software.  Results pertain to silt loam soils common in major rice producing regions of the humid mid-Southern U.S.",null,null,null,null,null,null,null,null,null,null,null,null,null,null,null,null,null,null,null,null,null,null,null,null,null,null,null,null,null,null,null,null,null,null,null,null,null,null,null,null,null,null,null,0,0,0,0,null,999,null,0]
[184,96.825396825396822,120,2012,57,41,142,0,null,null,null,null,null,null,null,null,null,null,null,null,null,null,null,null,null,null,null,null,null,null,null,null,null,null,null,null,null,null,null,null,null,null,null,null,null,null,null,null,null,null,null,null,null,null,null,null,null,null,null,null,69.817073170731703,45.381097560975597,0,73,null,45.381097560975597,null,0]
[185,96.825396825396822,160,2012,57,52,156,0,null,null,null,null,null,null,null,null,null,null,null,null,null,null,null,null,null,null,null,null,null,null,null,null,null,null,null,null,null,null,null,null,null,null,null,null,null,null,null,null,null,null,null,null,null,null,null,null,null,null,null,null,83.536585365853696,54.298780487804898,30,80,null,54.298780487804898,null,27.915272701507075]
[186,96.875,0,2012,58,2,185,0,null,null,null,null,null,null,null,null,null,"Potash fertilizer needed @ RY = 100 if possible or K max or zero if yield max at negative K:",null,{"$f":"IF((IF(W142,K159,O159)+IF(W142,K161,O161)*($U$151+$Y$151)+IF(W142,K162,O162)*($U$151+$Y$151)^2)/(-2*(IF(W142,K160,O160)+IF(W142,K163,O163)*($U$151+$Y$151)^2+IF(W142,K164,O164)*($U$151+$Y$151)))>$Y$149,$Y$149,(IF(W142,K159,O159)+IF(W142,K161,O161)*($U$151+$Y$151)+IF(W142,K162,O162)*($U$151+$Y$151)^2)/(-2*(IF(W142,K160,O160)+IF(W142,K163,O163)*($U$151+$Y$151)^2+IF(W142,K164,O164)*($U$151+$Y$151))))","v":147.50382437354529},{"$f":"IF((IF(W142,K159,O159)+IF(W142,K161,O161)*($U$151)+IF(W142,K162,O162)*($U$151)^2)/(-2*(IF(W142,K160,O160)+IF(W142,K163,O163)*($U$151)^2+IF(W142,K164,O164)*($U$151)))>$Y$149,$Y$149,(IF(W142,K159,O159)+IF(W142,K161,O161)*($U$151)+IF(W142,K162,O162)*($U$151)^2)/(-2*(IF(W142,K160,O160)+IF(W142,K163,O163)*($U$151)^2+IF(W142,K164,O164)*($U$151))))","v":151.22372315632484},{"$f":"IF((IF(W142,K159,O159)+IF(W142,K161,O161)*($U$151-$Y$151)+IF(W142,K162,O162)*($U$151-$Y$151)^2)/(-2*(IF(W142,K160,O160)+IF(W142,K163,O163)*($U$151-$Y$151)^2+IF(W142,K164,O164)*($U$151-$Y$151)))>$Y$149,$Y$149,(IF(W142,K159,O159)+IF(W142,K161,O161)*($U$151-$Y$151)+IF(W142,K162,O162)*($U$151-$Y$151)^2)/(-2*(IF(W142,K160,O160)+IF(W142,K163,O163)*($U$151-$Y$151)^2+IF(W142,K164,O164)*($U$151-$Y$151))))","v":153.96676309631971},null,null,null,null,null,null,null,null,null,null,null,null,null,null,null,null,null,null,null,null,null,null,null,null,null,null,null,null,null,null,null,null,null,null,null,null,null,null,87.042682926829301,56.577743902439003,60,78,null,56.577743902439003,null,55.830545403014149]
[187,100,80,2012,58,32,72,0,null,null,null,null,null,null,null,null,null,null,null,{"$f":"IF(T187<0,0,IFERROR((SQRT(T191^2+4*T192*T190)-T191)/(2*T192),$Y$149))","v":180},{"$f":"IF(U187<0,0,IFERROR((SQRT(U191^2+4*U192*U190)-U191)/(2*U192),$Y$149))","v":180},{"$f":"IF(V187<0,0,IFERROR((SQRT(V191^2+4*V192*V190)-V191)/(2*V192),$Y$149))","v":180},null,null,null,null,null,null,null,null,null,null,null,null,null,null,null,null,null,null,null,null,null,null,null,null,null,null,null,null,null,null,null,null,null,null,null,null,null,null,91.615853658536594,59.550304878048799,90,79,null,59.550304878048799,null,83.74581810452122]
[188,89.85507246376811,0,2012,59,3,72,0,null,null,null,null,null,null,null,null,null,null,null,null,null,null,null,null,null,null,null,null,null,null,null,null,null,null,null,null,null,null,null,null,null,null,null,null,null,null,null,null,null,null,null,null,null,null,null,null,null,null,null,null,100,65,120,85,null,65,null,111.6610908060283]
[189,100,80,2012,59,33,72,0,null,null,null,null,null,null,null,null,null,null,"c",{"$f":"100-$K$156-$K$157*(U151+Y151)-$K$158*(U151+Y151)^2","v":14.312838677368735},{"$f":"100-$K$156-$K$157*U151-$K$158*U151^2","v":17.735219681185704},{"$f":"100-$K$156-$K$157*(U151-Y151)-$K$158*(U151-Y151)^2","v":21.500282582703445},null,null,null,null,null,null,null,null,null,null,null,null,null,null,null,null,null,null,null,null,null,null,null,null,null,null,null,null,null,null,null,null,null,null,null,null,null,null,74.812030075188005,48.627819548872203,0,71,null,48.627819548872203,null,0]
[190,95.833333333333343,0,2012,60,4,72,0,null,null,null,null,null,null,null,null,null,null,"a",{"$f":"IF(W142,K159,O159)+IF(W142,K161,O161)*(U151+Y151)+IF(W142,K162,O162)*(U151+Y151)^2","v":0.17073441875116818},{"$f":"IF(W142,K159,O159)+IF(W142,K161,O161)*(U151)+IF(W142,K162,O162)*(U151)^2","v":0.2166320952800912},{"$f":"IF(W142,K159,O159)+IF(W142,K161,O161)*(U151-Y151)+IF(W142,K162,O162)*(U151-Y151)^2","v":0.26716094608318741},null,null,null,null,null,null,null,null,null,null,null,null,null,null,null,null,null,null,null,null,null,null,null,null,null,null,null,null,null,null,null,null,null,null,null,null,null,null,84.0225563909774,54.614661654135297,30,70,null,54.614661654135297,null,27.915272701507075]
[191,95.833333333333343,45,2012,60,22,95,0,null,null,null,null,null,null,null,null,null,null,"b",{"$f":"+IF(W142,K160,O160)+IF(W142,K163,O163)*(U151+Y151)^2+IF(W142,K164,O164)*(U151+Y151)","v":-5.7874573583527127E-4},{"$f":"+IF(W142,K160,O160)+IF(W142,K163,O163)*(U151)^2+IF(W142,K164,O164)*(U151)","v":-7.1626359528310121E-4},{"$f":"+IF(W142,K160,O160)+IF(W142,K163,O163)*(U151-Y151)^2+IF(W142,K164,O164)*(U151-Y151)","v":-8.6759291651814104E-4},null,null,null,null,null,null,null,null,null,null,null,null,null,null,null,null,null,null,null,null,null,null,null,null,null,null,null,null,null,null,null,null,null,null,null,null,null,null,89.473684210526301,58.157894736842103,60,81,null,58.157894736842103,null,55.830545403014149]
[192,100,90,2012,60,39,95,0,null,null,null,null,null,null,null,null,null,null,null,null,null,null,null,null,null,null,null,null,null,null,null,null,null,null,null,null,null,null,null,null,null,null,null,null,null,null,null,null,null,null,null,null,null,null,null,null,null,null,null,null,0,0,0,0,null,999,null,0]
[193,91.755725190839698,0,2012,61,5,95,0,null,null,null,null,null,null,null,null,null,null,null,null,null,null,null,null,null,null,null,null,null,null,null,null,null,null,null,null,null,null,null,null,null,null,null,null,null,null,null,null,null,null,null,null,null,null,null,null,null,null,null,null,0,0,0,0,null,999,null,0]
[194,99.84732824427482,40,2012,61,15,64,0,null,null,null,null,null,null,null,null,null,null,null,null,null,null,null,null,null,null,null,null,null,null,null,null,null,null,null,null,null,null,null,null,null,null,null,null,null,null,null,null,null,null,null,null,null,null,null,null,null,null,null,null,70.805369127516798,46.023489932885902,0,65,null,46.023489932885902,null,0]
[195,97.404580152671755,80,2012,61,34,73,0,null,null,null,null,null,null,null,null,null,null,null,null,null,null,null,null,null,null,null,null,null,null,null,null,null,null,null,null,null,null,null,null,null,null,null,null,null,null,null,null,null,null,null,null,null,null,null,null,null,null,null,null,81.040268456375799,52.6761744966443,30,68,null,52.6761744966443,null,27.915272701507075]
[196,100,120,2012,61,42,78,0,null,null,null,null,null,null,null,null,null,null,null,null,null,null,null,null,null,null,null,null,null,null,null,null,null,null,null,null,null,null,null,null,null,null,null,null,null,null,null,null,null,null,null,null,null,null,null,null,null,null,null,null,94.630872483221495,61.510067114093999,60,63,null,61.510067114093999,null,55.830545403014149]
[197,98.778625954198475,160,2012,61,53,82,0,null,null,null,null,null,null,null,null,null,null,null,null,null,null,null,null,null,null,null,null,null,null,null,null,null,null,null,null,null,null,null,null,null,null,null,null,null,null,null,null,null,null,null,null,null,null,null,null,null,null,null,null,92.785234899328898,60.310402684563797,90,83,null,60.310402684563797,null,83.74581810452122]
[198,72.950819672131146,0,2013,62,1,91,0,null,null,null,null,null,null,null,null,null,null,null,null,null,null,null,null,null,null,null,null,null,null,null,null,null,null,null,null,null,null,null,null,null,null,null,null,null,null,null,null,null,null,null,null,null,null,null,null,null,null,null,null,100,65,120,79,null,65,null,111.6610908060283]
[199,95.491803278688522,40,2013,62,14,64,0,null,null,null,null,null,null,null,null,null,null,null,null,null,null,null,null,null,null,null,null,null,null,null,null,null,null,null,null,null,null,null,null,null,null,null,null,null,null,null,null,null,null,null,null,null,null,null,null,null,null,null,null,0,0,0,0,null,999,null,0]
[200,96.311475409836063,80,2013,62,31,71,0,null,null,null,null,null,null,null,null,null,null,null,null,null,null,null,null,null,null,null,null,null,null,null,null,null,null,null,null,null,null,null,null,null,null,null,null,null,null,null,null,null,null,null,null,null,null,null,null,null,null,null,null,0,0,0,0,null,999,null,0]
[201,99.180327868852444,120,2013,62,41,74,0,null,null,null,null,null,null,null,null,null,null,null,null,null,null,null,null,null,null,null,null,null,null,null,null,null,null,null,null,null,null,null,null,null,null,null,null,null,null,null,null,null,null,null,null,null,null,null,null,null,null,null,null,0,0,0,0,null,999,null,0]
[202,100,160,2013,62,52,81,0,null,null,null,null,null,null,null,null,null,null,null,null,null,null,null,null,null,null,null,null,null,null,null,null,null,null,null,null,null,null,null,null,null,null,null,null,null,null,null,null,null,null,null,null,null,null,null,null,null,null,null,null,0,0,0,0,null,999,null,0]
[203,93.220338983050837,0,2013,64,3,83,0,null,null,null,null,null,null,null,null,null,null,null,null,null,null,null,null,null,null,null,null,null,null,null,null,null,null,null,null,null,null,null,null,null,null,null,null,null,null,null,null,null,null,null,null,null,null,null,null,null,null,null,null,0,0,0,0,null,999,null,0]
[204,100,80,2013,64,33,80,0,null,null,null,null,null,null,null,null,null,null,null,null,null,null,null,null,null,null,null,null,null,null,null,null,null,null,null,null,null,null,null,null,null,null,null,null,null,null,null,null,null,null,null,null,null,null,null,null,null,null,null,null,77.477477477477507,50.360360360360403,0,72,null,50.360360360360403,null,0]
[205,86.6279069767442,0,2013,77,4,98,0,null,null,null,null,null,null,null,null,null,null,null,null,null,null,null,null,null,null,null,null,null,null,null,null,null,null,null,null,null,null,null,null,null,null,null,null,null,null,null,null,null,null,null,null,null,null,null,null,null,null,null,null,85.585585585585605,55.630630630630598,40,72,null,55.630630630630598,null,37.220363602009435]
[206,91.279069767441854,60,2013,77,23,118,0,null,null,null,null,null,null,null,null,null,null,null,null,null,null,null,null,null,null,null,null,null,null,null,null,null,null,null,null,null,null,null,null,null,null,null,null,null,null,null,null,null,null,null,null,null,null,null,null,null,null,null,null,97.837837837837796,63.594594594594597,80,72,null,63.594594594594597,null,74.44072720401887]
[207,100,120,2013,77,43,140,0,null,null,null,null,null,null,null,null,null,null,null,null,null,null,null,null,null,null,null,null,null,null,null,null,null,null,null,null,null,null,null,null,null,null,null,null,null,null,null,null,null,null,null,null,null,null,null,null,null,null,null,null,98.738738738738704,64.180180180180201,120,72,null,64.180180180180201,null,111.6610908060283]
[208,90.116279069767444,160,2013,77,54,186,0,null,null,null,null,null,null,null,null,null,null,null,null,null,null,null,null,null,null,null,null,null,null,null,null,null,null,null,null,null,null,null,null,null,null,null,null,null,null,null,null,null,null,null,null,null,null,null,null,null,null,null,null,100,65,160,72,null,65,null,148.88145440803774]
[209,97.814207650273204,0,2013,82,5,101,0,null,null,null,null,null,null,null,null,null,null,null,null,null,null,null,null,null,null,null,null,null,null,null,null,null,null,null,null,null,null,null,null,null,null,null,null,null,null,null,null,null,null,null,null,null,null,null,null,null,null,null,null,0,0,0,0,null,999,null,0]
[210,100,60,2013,82,24,101,0,null,null,null,null,null,null,null,null,null,null,null,null,null,null,null,null,null,null,null,null,null,null,null,null,null,null,null,null,null,null,null,null,null,null,null,null,null,null,null,null,null,null,null,null,null,null,null,null,null,null,null,null,0,0,0,0,null,999,null,0]
[211,96.038251366120207,120,2013,82,44,83,0,null,null,null,null,null,null,null,null,null,null,null,null,null,null,null,null,null,null,null,null,null,null,null,null,null,null,null,null,null,null,null,null,null,null,null,null,null,null,null,null,null,null,null,null,null,null,null,null,null,null,null,null,0,0,0,0,null,999,null,0]
[212,94.945355191256837,160,2013,82,55,83,0,null,null,null,null,null,null,null,null,null,null,null,null,null,null,null,null,null,null,null,null,null,null,null,null,null,null,null,null,null,null,null,null,null,null,null,null,null,null,null,null,null,null,null,null,null,null,null,null,null,null,null,null,0,0,0,0,null,999,null,0]
[213,97.795071335927389,0,2013,83,6,83,1,null,null,null,null,null,null,null,null,null,null,null,null,null,null,null,null,null,null,null,null,null,null,null,null,null,null,null,null,null,null,null,null,null,null,null,null,null,null,null,null,null,null,null,null,null,null,null,null,null,null,null,null,0,0,0,0,null,999,null,0]
[214,100,60,2013,83,25,83,1,null,null,null,null,null,null,null,null,null,null,null,null,null,null,null,null,null,null,null,null,null,null,null,null,null,null,null,null,null,null,null,null,null,null,null,null,null,null,null,null,null,null,null,null,null,null,null,null,null,null,null,null,0,0,0,0,null,999,null,0]
[215,98.313878080415051,120,2013,83,45,131,1,null,null,null,null,null,null,null,null,null,null,null,null,null,null,null,null,null,null,null,null,null,null,null,null,null,null,null,null,null,null,null,null,null,null,null,null,null,null,null,null,null,null,null,null,null,null,null,null,null,null,null,null,0,0,0,0,null,999,null,0]
[216,98.054474708171199,160,2013,83,56,131,1,null,null,null,null,null,null,null,null,null,null,null,null,null,null,null,null,null,null,null,null,null,null,null,null,null,null,null,null,null,null,null,null,null,null,null,null,null,null,null,null,null,null,null,null,null,null,null,null,null,null,null,null,0,0,0,0,null,999,null,0]
[217,100.12165450121653,0,2013,87,7,131,1,null,null,null,null,null,null,null,null,null,null,null,null,null,null,null,null,null,null,null,null,null,null,null,null,null,null,null,null,null,null,null,null,null,null,null,null,null,null,null,null,null,null,null,null,null,null,null,null,null,null,null,null,0,0,0,0,null,999,null,0]
[218,99.026763990267639,60,2013,87,26,131,1,null,null,null,null,null,null,null,null,null,null,null,null,null,null,null,null,null,null,null,null,null,null,null,null,null,null,null,null,null,null,null,null,null,null,null,null,null,null,null,null,null,null,null,null,null,null,null,null,null,null,null,null,0,0,0,0,null,999,null,0]
[219,99.513381995133813,120,2013,87,46,353,1,null,null,null,null,null,null,null,null,null,null,null,null,null,null,null,null,null,null,null,null,null,null,null,null,null,null,null,null,null,null,null,null,null,null,null,null,null,null,null,null,null,null,null,null,null,null,null,null,null,null,null,null,0,0,0,0,null,999,null,0]
[220,100,160,2013,87,57,353,1,null,null,null,null,null,null,null,null,null,null,null,null,null,null,null,null,null,null,null,null,null,null,null,null,null,null,null,null,null,null,null,null,null,null,null,null,null,null,null,null,null,null,null,null,null,null,null,null,null,null,null,null,0,0,0,0,null,999,null,0]
[221,97.846567967698533,0,2013,88,8,353,1,null,null,null,null,null,null,null,null,null,null,null,null,null,null,null,null,null,null,null,null,null,null,null,null,null,null,null,null,null,null,null,null,null,null,null,null,null,null,null,null,null,null,null,null,null,null,null,null,null,null,null,null,0,0,0,0,null,999,null,0]
[222,97.711978465679678,60,2013,88,27,353,1,null,null,null,null,null,null,null,null,null,null,null,null,null,null,null,null,null,null,null,null,null,null,null,null,null,null,null,null,null,null,null,null,null,null,null,null,null,null,null,null,null,null,null,null,null,null,null,null,null,null,null,null,0,0,0,0,null,999,null,0]
[223,100,120,2013,88,47,157,1,null,null,null,null,null,null,null,null,null,null,null,null,null,null,null,null,null,null,null,null,null,null,null,null,null,null,null,null,null,null,null,null,null,null,null,null,null,null,null,null,null,null,null,null,null,null,null,null,null,null,null,null,0,0,0,0,null,999,null,0]
[224,99.461641991924637,160,2013,88,58,157,1,null,null,null,null,null,null,null,null,null,null,null,null,null,null,null,null,null,null,null,null,null,null,null,null,null,null,null,null,null,null,null,null,null,null,null,null,null,null,null,null,null,null,null,null,null,null,null,null,null,null,null,null,0,0,0,0,null,999,null,0]
[225,90.398126463700237,0,2013,90,9,157,0,null,null,null,null,null,null,null,null,null,null,null,null,null,null,null,null,null,null,null,null,null,null,null,null,null,null,null,null,null,null,null,null,null,null,null,null,null,null,null,null,null,null,null,null,null,null,null,null,null,null,null,null,0,0,0,0,null,999,null,0]
[226,96.370023419203733,60,2013,90,28,157,0,null,null,null,null,null,null,null,null,null,null,null,null,null,null,null,null,null,null,null,null,null,null,null,null,null,null,null,null,null,null,null,null,null,null,null,null,null,null,null,null,null,null,null,null,null,null,null,null,null,null,null,null,0,0,0,0,null,999,null,0]
[227,96.604215456674467,120,2013,90,48,330,0,null,null,null,null,null,null,null,null,null,null,null,null,null,null,null,null,null,null,null,null,null,null,null,null,null,null,null,null,null,null,null,null,null,null,null,null,null,null,null,null,null,null,null,null,null,null,null,null,null,null,null,null,0,0,0,0,null,999,null,0]
[228,100,160,2013,90,59,330,0,null,null,null,null,null,null,null,null,null,null,null,null,null,null,null,null,null,null,null,null,null,null,null,null,null,null,null,null,null,null,null,null,null,null,null,null,null,null,null,null,null,null,null,null,null,null,null,null,null,null,null,null,0,0,0,0,null,999,null,0]
[229,82.587859424920126,0,2014,66,1,330,0,null,null,null,null,null,null,null,null,null,null,null,null,null,null,null,null,null,null,null,null,null,null,null,null,null,null,null,null,null,null,null,null,null,null,null,null,null,null,null,null,null,null,null,null,null,null,null,null,null,null,null,null,0,0,0,0,null,999,null,0]
[230,100,80,2014,66,31,330,0,null,null,null,null,null,null,null,null,null,null,null,null,null,null,null,null,null,null,null,null,null,null,null,null,null,null,null,null,null,null,null,null,null,null,null,null,null,null,null,null,null,null,null,null,null,null,null,null,null,null,null,null,0,0,0,0,null,999,null,0]
[231,87.35177865612647,0,2014,67,2,96,0,null,null,null,null,null,null,null,null,null,null,null,null,null,null,null,null,null,null,null,null,null,null,null,null,null,null,null,null,null,null,null,null,null,null,null,null,null,null,null,null,null,null,null,null,null,null,null,null,null,null,null,null,0,0,0,0,null,999,null,0]
[232,95.915678524374172,40,2014,67,14,96,0,null,null,null,null,null,null,null,null,null,null,null,null,null,null,null,null,null,null,null,null,null,null,null,null,null,null,null,null,null,null,null,null,null,null,null,null,null,null,null,null,null,null,null,null,null,null,null,null,null,null,null,null,0,0,0,0,null,999,null,0]
[233,93.280632411067188,80,2014,67,32,96,0,null,null,null,null,null,null,null,null,null,null,null,null,null,null,null,null,null,null,null,null,null,null,null,null,null,null,null,null,null,null,null,null,null,null,null,null,null,null,null,null,null,null,null,null,null,null,null,null,null,null,null,null,0,0,0,0,null,999,null,0]
[234,97.891963109354407,120,2014,67,41,96,0,null,null,null,null,null,null,null,null,null,null,null,null,null,null,null,null,null,null,null,null,null,null,null,null,null,null,null,null,null,null,null,null,null,null,null,null,null,null,null,null,null,null,null,null,null,null,null,null,null,null,null,null,73.731343283582106,47.925373134328403,0,86,null,47.925373134328403,null,0]
[235,100,160,2014,67,52,58,0,null,null,null,null,null,null,null,null,null,null,null,null,null,null,null,null,null,null,null,null,null,null,null,null,null,null,null,null,null,null,null,null,null,null,null,null,null,null,null,null,null,null,null,null,null,null,null,null,null,null,null,null,82.388059701492594,53.552238805970198,40,86,null,53.552238805970198,null,37.220363602009435]
[236,83.136593591905566,0,2014,68,3,58,0,null,null,null,null,null,null,null,null,null,null,null,null,null,null,null,null,null,null,null,null,null,null,null,null,null,null,null,null,null,null,null,null,null,null,null,null,null,null,null,null,null,null,null,null,null,null,null,null,null,null,null,null,93.283582089552198,60.634328358208897,80,86,null,60.634328358208897,null,74.44072720401887]
[237,92.748735244519395,40,2014,68,15,99,0,null,null,null,null,null,null,null,null,null,null,null,null,null,null,null,null,null,null,null,null,null,null,null,null,null,null,null,null,null,null,null,null,null,null,null,null,null,null,null,null,null,null,null,null,null,null,null,null,null,null,null,null,98.208955223880594,63.835820895522403,120,86,null,63.835820895522403,null,111.6610908060283]
[238,96.627318718381119,80,2014,68,33,99,0,null,null,null,null,null,null,null,null,null,null,null,null,null,null,null,null,null,null,null,null,null,null,null,null,null,null,null,null,null,null,null,null,null,null,null,null,null,null,null,null,null,null,null,null,null,null,null,null,null,null,null,null,100,65,160,86,null,65,null,148.88145440803774]
[239,100,120,2014,68,42,99,0,null,null,null,null,null,null,null,null,null,null,null,null,null,null,null,null,null,null,null,null,null,null,null,null,null,null,null,null,null,null,null,null,null,null,null,null,null,null,null,null,null,null,null,null,null,null,null,null,null,null,null,null,{"$f":"_xlfn.NUMBERVALUE(IF(AND($G67>=($U$151-$Y$151),$G67<=($U$151+$Y$151)),B67,\"\"))","v":0},{"$f":"_xlfn.NUMBERVALUE(IFERROR(+BI240*$W$149,\"\"))","v":0},{"$f":"_xlfn.NUMBERVALUE(IF(AND($G67>=($U$151-$Y$151),$G67<=($U$151+$Y$151)),C67,\"\"))","v":0},{"$f":"_xlfn.NUMBERVALUE(IF(AND($G67>=($U$151-$Y$151),$G67<=($U$151+$Y$151)),G67,\"\"))","v":0},null,{"$f":"IF(BJ240=0,999,BJ240)","v":999},null,{"$f":"+BK240*$BP$172","v":0}]
[240,98.145025295109619,160,2014,68,53,99,0,null,null,null,null,null,null,null,null,null,null,null,null,null,null,null,null,null,null,null,null,null,null,null,null,null,null,null,null,null,null,null,null,null,null,null,null,null,null,null,null,null,null,null,null,null,null,null,null,null,null,null,null,0,0,0,0,null,999,null,0]
[241,77.286585365853668,0,2014,78,4,99,0,null,null,null,null,null,null,null,null,null,null,null,null,null,null,null,null,null,null,null,null,null,null,null,null,null,null,null,null,null,null,null,null,null,null,null,null,null,null,null,null,null,null,null,null,null,null,null,null,null,null,null,null,0,0,0,0,null,999,null,0]
[242,89.176829268292693,60,2014,78,23,73,0,null,null,null,null,null,null,null,null,null,null,null,null,null,null,null,null,null,null,null,null,null,null,null,null,null,null,null,null,null,null,null,null,null,null,null,null,null,null,null,null,null,null,null,null,null,null,null,null,null,null,null,null,0,0,0,0,null,999,null,0]
[243,97.408536585365852,120,2014,78,43,83,0,null,null,null,null,null,null,null,null,null,null,null,null,null,null,null,null,null,null,null,null,null,null,null,null,null,null,null,null,null,null,null,null,null,null,null,null,null,null,null,null,null,null,null,null,null,null,null,null,null,null,null,null,0,0,0,0,null,999,null,0]
[244,100,160,2014,78,54,87,0,null,null,null,null,null,null,null,null,null,null,null,null,null,null,null,null,null,null,null,null,null,null,null,null,null,null,null,null,null,null,null,null,null,null,null,null,null,null,null,null,null,null,null,null,null,null,null,null,null,null,null,null,0,0,0,0,null,999,null,0]
[245,100.68027210884354,0,2014,79,5,100,0,null,null,null,null,null,null,null,null,null,null,null,null,null,null,null,null,null,null,null,null,null,null,null,null,null,null,null,null,null,null,null,null,null,null,null,null,null,null,null,null,null,null,null,null,null,null,null,null,null,null,null,null,0,0,0,0,null,999,null,0]
[246,97.61904761904762,60,2014,79,24,125,0,null,null,null,null,null,null,null,null,null,null,null,null,null,null,null,null,null,null,null,null,null,null,null,null,null,null,null,null,null,null,null,null,null,null,null,null,null,null,null,null,null,null,null,null,null,null,null,null,null,null,null,null,0,0,0,0,null,999,null,0]
[247,98.639455782312936,120,2014,79,44,60,0,null,null,null,null,null,null,null,null,null,null,null,null,null,null,null,null,null,null,null,null,null,null,null,null,null,null,null,null,null,null,null,null,null,null,null,null,null,null,null,null,null,null,null,null,null,null,null,null,null,null,null,null,0,0,0,0,null,999,null,0]
[248,100,160,2014,79,55,60,0,null,null,null,null,null,null,null,null,null,null,null,null,null,null,null,null,null,null,null,null,null,null,null,null,null,null,null,null,null,null,null,null,null,null,null,null,null,null,null,null,null,null,null,null,null,null,null,null,null,null,null,null,0,0,0,0,null,999,null,0]
[249,94.182389937106919,0,2014,80,6,60,0,null,null,null,null,null,null,null,null,null,null,null,null,null,null,null,null,null,null,null,null,null,null,null,null,null,null,null,null,null,null,null,null,null,null,null,null,null,null,null,null,null,null,null,null,null,null,null,null,null,null,null,null,64.688427299703307,42.047477744807203,0,60,null,42.047477744807203,null,0]
[250,96.698113207547166,60,2014,80,25,60,0,null,null,null,null,null,null,null,null,null,null,null,null,null,null,null,null,null,null,null,null,null,null,null,null,null,null,null,null,null,null,null,null,null,null,null,null,null,null,null,null,null,null,null,null,null,null,null,null,null,null,null,null,86.646884272996999,56.320474777447998,40,72,null,56.320474777447998,null,37.220363602009435]
[251,99.371069182389931,120,2014,80,45,78,0,null,null,null,null,null,null,null,null,null,null,null,null,null,null,null,null,null,null,null,null,null,null,null,null,null,null,null,null,null,null,null,null,null,null,null,null,null,null,null,null,null,null,null,null,null,null,null,null,null,null,null,null,89.910979228486596,58.442136498516298,80,78,null,58.442136498516298,null,74.44072720401887]
[252,100,160,2014,80,56,78,0,null,null,null,null,null,null,null,null,null,null,null,null,null,null,null,null,null,null,null,null,null,null,null,null,null,null,null,null,null,null,null,null,null,null,null,null,null,null,null,null,null,null,null,null,null,null,null,null,null,null,null,null,100,65,120,81,null,65,null,111.6610908060283]
[253,93.28743545611016,0,2014,81,7,78,0,null,null,null,null,null,null,null,null,null,null,null,null,null,null,null,null,null,null,null,null,null,null,null,null,null,null,null,null,null,null,null,null,null,null,null,null,null,null,null,null,null,null,null,null,null,null,null,null,null,null,null,null,0,0,0,0,null,999,null,0]
[254,100,60,2014,81,26,78,0,null,null,null,null,null,null,null,null,null,null,null,null,null,null,null,null,null,null,null,null,null,null,null,null,null,null,null,null,null,null,null,null,null,null,null,null,null,null,null,null,null,null,null,null,null,null,null,null,null,null,null,null,65.507649513212797,42.579972183588303,0,71,null,42.579972183588303,null,0]
[255,97.934595524956976,120,2014,81,46,76,0,null,null,null,null,null,null,null,null,null,null,null,null,null,null,null,null,null,null,null,null,null,null,null,null,null,null,null,null,null,null,null,null,null,null,null,null,null,null,null,null,null,null,null,null,null,null,null,null,null,null,null,null,91.098748261474299,59.214186369958298,40,67,null,59.214186369958298,null,37.220363602009435]
[256,97.590361445783131,160,2014,81,57,76,0,null,null,null,null,null,null,null,null,null,null,null,null,null,null,null,null,null,null,null,null,null,null,null,null,null,null,null,null,null,null,null,null,null,null,null,null,null,null,null,null,null,null,null,null,null,null,null,null,null,null,null,null,94.019471488177999,61.112656467315702,80,72,null,61.112656467315702,null,74.44072720401887]
[257,97.025495750708217,0,2014,84,8,76,0,null,null,null,null,null,null,null,null,null,null,null,null,null,null,null,null,null,null,null,null,null,null,null,null,null,null,null,null,null,null,null,null,null,null,null,null,null,null,null,null,null,null,null,null,null,null,null,null,null,null,null,null,92.628650904033407,60.208623087621703,120,78,null,60.208623087621703,null,111.6610908060283]
[258,100,60,2014,84,27,76,0,null,null,null,null,null,null,null,null,null,null,null,null,null,null,null,null,null,null,null,null,null,null,null,null,null,null,null,null,null,null,null,null,null,null,null,null,null,null,null,null,null,null,null,null,null,null,null,null,null,null,null,null,0,0,0,0,null,999,null,0]
[259,95.75070821529745,120,2014,84,47,72,0,null,null,null,null,null,null,null,null,null,null,null,null,null,null,null,null,null,null,null,null,null,null,null,null,null,null,null,null,null,null,null,null,null,null,null,null,null,null,null,null,null,null,null,null,null,null,null,null,null,null,null,null,0,0,0,0,null,999,null,0]
[260,95.892351274787544,160,2014,84,58,72,0,null,null,null,null,null,null,null,null,null,null,null,null,null,null,null,null,null,null,null,null,null,null,null,null,null,null,null,null,null,null,null,null,null,null,null,null,null,null,null,null,null,null,null,null,null,null,null,null,null,null,null,null,0,0,0,0,null,999,null,0]
[261,90.619765494137354,0,2014,85,9,72,1,null,null,null,null,null,null,null,null,null,null,null,null,null,null,null,null,null,null,null,null,null,null,null,null,null,null,null,null,null,null,null,null,null,null,null,null,null,null,null,null,null,null,null,null,null,null,null,null,null,null,null,null,0,0,0,0,null,999,null,0]
[262,100,60,2014,85,28,72,1,null,null,null,null,null,null,null,null,null,null,null,null,null,null,null,null,null,null,null,null,null,null,null,null,null,null,null,null,null,null,null,null,null,null,null,null,null,null,null,null,null,null,null,null,null,null,null,null,null,null,null,null,0,0,0,0,null,999,null,0]
[263,96.314907872696807,120,2014,85,48,161,1,null,null,null,null,null,null,null,null,null,null,null,null,null,null,null,null,null,null,null,null,null,null,null,null,null,null,null,null,null,null,null,null,null,null,null,null,null,null,null,null,null,null,null,null,null,null,null,null,null,null,null,null,0,0,0,0,null,999,null,0]
[264,94.9748743718593,160,2014,85,59,161,1,null,null,null,null,null,null,null,null,null,null,null,null,null,null,null,null,null,null,null,null,null,null,null,null,null,null,null,null,null,null,null,null,null,null,null,null,null,null,null,null,null,null,null,null,null,null,null,null,null,null,null,null,0,0,0,0,null,999,null,0]
[265,96.8888888888889,0,2014,86,10,161,1,null,null,null,null,null,null,null,null,null,null,null,null,null,null,null,null,null,null,null,null,null,null,null,null,null,null,null,null,null,null,null,null,null,null,null,null,null,null,null,null,null,null,null,null,null,null,null,null,null,null,null,null,0,0,0,0,null,999,null,0]
[266,100,60,2014,86,29,161,1,null,null,null,null,null,null,null,null,null,null,null,null,null,null,null,null,null,null,null,null,null,null,null,null,null,null,null,null,null,null,null,null,null,null,null,null,null,null,null,null,null,null,null,null,null,null,null,null,null,null,null,null,0,0,0,0,null,999,null,0]
[267,97.481481481481481,120,2014,86,49,146,1,null,null,null,null,null,null,null,null,null,null,null,null,null,null,null,null,null,null,null,null,null,null,null,null,null,null,null,null,null,null,null,null,null,null,null,null,null,null,null,null,null,null,null,null,null,null,null,null,null,null,null,null,0,0,0,0,null,999,null,0]
[268,95.851851851851848,160,2014,86,60,146,1,null,null,null,null,null,null,null,null,null,null,null,null,null,null,null,null,null,null,null,null,null,null,null,null,null,null,null,null,null,null,null,null,null,null,null,null,null,null,null,null,null,null,null,null,null,null,null,null,null,null,null,null,0,0,0,0,null,999,null,0]
[269,98.171846435100548,0,2014,89,11,146,1,null,null,null,null,null,null,null,null,null,null,null,null,null,null,null,null,null,null,null,null,null,null,null,null,null,null,null,null,null,null,null,null,null,null,null,null,null,null,null,null,null,null,null,null,null,null,null,null,null,null,null,null,0,0,0,0,null,999,null,0]
[270,97.806215722120655,60,2014,89,30,146,1,null,null,null,null,null,null,null,null,null,null,null,null,null,null,null,null,null,null,null,null,null,null,null,null,null,null,null,null,null,null,null,null,null,null,null,null,null,null,null,null,null,null,null,null,null,null,null,null,null,null,null,null,0,0,0,0,null,999,null,0]
[271,100,120,2014,89,50,201,1,null,null,null,null,null,null,null,null,null,null,null,null,null,null,null,null,null,null,null,null,null,null,null,null,null,null,null,null,null,null,null,null,null,null,null,null,null,null,null,null,null,null,null,null,null,null,null,null,null,null,null,null,0,0,0,0,null,999,null,0]
[272,96.160877513711156,160,2014,89,61,201,1,null,null,null,null,null,null,null,null,null,null,null,null,null,null,null,null,null,null,null,null,null,null,null,null,null,null,null,null,null,null,null,null,null,null,null,null,null,null,null,null,null,null,null,null,null,null,null,null,null,null,null,null,0,0,0,0,null,999,null,0]
[273,71.208226221079698,0,2015,69,1,201,0,null,null,null,null,null,null,null,null,null,null,null,null,null,null,null,null,null,null,null,null,null,null,null,null,null,null,null,null,null,null,null,null,null,null,null,null,null,null,null,null,null,null,null,null,null,null,null,null,null,null,null,null,0,0,0,0,null,999,null,0]
[274,88.431876606683801,40,2015,69,14,201,0,null,null,null,null,null,null,null,null,null,null,null,null,null,null,null,null,null,null,null,null,null,null,null,null,null,null,null,null,null,null,null,null,null,null,null,null,null,null,null,null,null,null,null,null,null,null,null,null,null,null,null,null,0,0,0,0,null,999,null,0]
[275,95.758354755784069,80,2015,69,31,267,0,null,null,null,null,null,null,null,null,null,null,null,null,null,null,null,null,null,null,null,null,null,null,null,null,null,null,null,null,null,null,null,null,null,null,null,null,null,null,null,null,null,null,null,null,null,null,null,null,null,null,null,null,0,0,0,0,null,999,null,0]
[276,99.485861182519287,120,2015,69,41,267,0,null,null,null,null,null,null,null,null,null,null,null,null,null,null,null,null,null,null,null,null,null,null,null,null,null,null,null,null,null,null,null,null,null,null,null,null,null,null,null,null,null,null,null,null,null,null,null,null,null,null,null,null,0,0,0,0,null,999,null,0]
[277,100,160,2015,69,52,267,0,null,null,null,null,null,null,null,null,null,null,null,null,null,null,null,null,null,null,null,null,null,null,null,null,null,null,null,null,null,null,null,null,null,null,null,null,null,null,null,null,null,null,null,null,null,null,null,null,null,null,null,null,0,0,0,0,null,999,null,0]
[278,85.873192436040043,0,2015,70,2,267,0,null,null,null,null,null,null,null,null,null,null,null,null,null,null,null,null,null,null,null,null,null,null,null,null,null,null,null,null,null,null,null,null,null,null,null,null,null,null,null,null,null,null,null,null,null,null,null,null,null,null,null,null,0,0,0,0,null,999,null,0]
[279,89.432703003337039,40,2015,70,15,35,0,null,null,null,null,null,null,null,null,null,null,null,null,null,null,null,null,null,null,null,null,null,null,null,null,null,null,null,null,null,null,null,null,null,null,null,null,null,null,null,null,null,null,null,null,null,null,null,null,null,null,null,null,0,0,0,0,null,999,null,0]
[280,92.213570634037822,80,2015,70,32,41,0,null,null,null,null,null,null,null,null,null,null,null,null,null,null,null,null,null,null,null,null,null,null,null,null,null,null,null,null,null,null,null,null,null,null,null,null,null,null,null,null,null,null,null,null,null,null,null,null,null,null,null,null,0,0,0,0,null,999,null,0]
[281,95.216907675194648,120,2015,70,42,49,0,null,null,null,null,null,null,null,null,null,null,null,null,null,null,null,null,null,null,null,null,null,null,null,null,null,null,null,null,null,null,null,null,null,null,null,null,null,null,null,null,null,null,null,null,null,null,null,null,null,null,null,null,0,0,0,0,null,999,null,0]
[282,100,160,2015,70,53,55,0,null,null,null,null,null,null,null,null,null,null,null,null,null,null,null,null,null,null,null,null,null,null,null,null,null,null,null,null,null,null,null,null,null,null,null,null,null,null,null,null,null,null,null,null,null,null,null,null,null,null,null,null,0,0,0,0,null,999,null,0]
[283,69.749216300940446,0,2015,71,3,64,0,null,null,null,null,null,null,null,null,null,null,null,null,null,null,null,null,null,null,null,null,null,null,null,null,null,null,null,null,null,null,null,null,null,null,null,null,null,null,null,null,null,null,null,null,null,null,null,null,null,null,null,null,0,0,0,0,null,999,null,0]
[284,88.087774294670851,60,2015,71,23,86,0,null,null,null,null,null,null,null,null,null,null,null,null,null,null,null,null,null,null,null,null,null,null,null,null,null,null,null,null,null,null,null,null,null,null,null,null,null,null,null,null,null,null,null,null,null,null,null,null,null,null,null,null,0,0,0,0,null,999,null,0]
[285,100,120,2015,71,43,100,0,null,null,null,null,null,null,null,null,null,null,null,null,null,null,null,null,null,null,null,null,null,null,null,null,null,null,null,null,null,null,null,null,null,null,null,null,null,null,null,null,null,null,null,null,null,null,null,null,null,null,null,null,0,0,0,0,null,999,null,0]
[286,88.768115942028984,0,2015,74,4,117,0,null,null,null,null,null,null,null,null,null,null,null,null,null,null,null,null,null,null,null,null,null,null,null,null,null,null,null,null,null,null,null,null,null,null,null,null,null,null,null,null,null,null,null,null,null,null,null,null,null,null,null,null,0,0,0,0,null,999,null,0]
[287,96.376811594202891,60,2015,74,24,141,0,null,null,null,null,null,null,null,null,null,null,null,null,null,null,null,null,null,null,null,null,null,null,null,null,null,null,null,null,null,null,null,null,null,null,null,null,null,null,null,null,null,null,null,null,null,null,null,null,null,null,null,null,0,0,0,0,null,999,null,0]
[288,100,120,2015,74,44,173,0,null,null,null,null,null,null,null,null,null,null,null,null,null,null,null,null,null,null,null,null,null,null,null,null,null,null,null,null,null,null,null,null,null,null,null,null,null,null,null,null,null,null,null,null,null,null,null,null,null,null,null,null,0,0,0,0,null,999,null,0]
[289,97.644927536231876,160,2015,74,54,35,0,null,null,null,null,null,null,null,null,null,null,null,null,null,null,null,null,null,null,null,null,null,null,null,null,null,null,null,null,null,null,null,null,null,null,null,null,null,null,null,null,null,null,null,null,null,null,null,null,null,null,null,null,0,0,0,0,null,999,null,0]
[290,89.2249527410208,0,2015,75,5,35,0,null,null,null,null,null,null,null,null,null,null,null,null,null,null,null,null,null,null,null,null,null,null,null,null,null,null,null,null,null,null,null,null,null,null,null,null,null,null,null,null,null,null,null,null,null,null,null,null,null,null,null,null,0,0,0,0,null,999,null,0]
[291,90.170132325141779,60,2015,75,25,35,0,null,null,null,null,null,null,null,null,null,null,null,null,null,null,null,null,null,null,null,null,null,null,null,null,null,null,null,null,null,null,null,null,null,null,null,null,null,null,null,null,null,null,null,null,null,null,null,null,null,null,null,null,0,0,0,0,null,999,null,0]
[292,98.487712665406434,120,2015,75,45,88,0,null,null,null,null,null,null,null,null,null,null,null,null,null,null,null,null,null,null,null,null,null,null,null,null,null,null,null,null,null,null,null,null,null,null,null,null,null,null,null,null,null,null,null,null,null,null,null,null,null,null,null,null,0,0,0,0,null,999,null,0]
[293,100,160,2015,75,55,88,0,null,null,null,null,null,null,null,null,null,null,null,null,null,null,null,null,null,null,null,null,null,null,null,null,null,null,null,null,null,null,null,null,null,null,null,null,null,null,null,null,null,null,null,null,null,null,null,null,null,null,null,null,0,0,0,0,null,999,null,0]
[294,97.035881435257423,0,2015,76,6,88,0,null,null,null,null,null,null,null,null,null,null,null,null,null,null,null,null,null,null,null,null,null,null,null,null,null,null,null,null,null,null,null,null,null,null,null,null,null,null,null,null,null,null,null,null,null,null,null,null,null,null,null,null,0,0,0,0,null,999,null,0]
[295,92.355694227769121,60,2015,76,26,88,0,null,null,null,null,null,null,null,null,null,null,null,null,null,null,null,null,null,null,null,null,null,null,null,null,null,null,null,null,null,null,null,null,null,null,null,null,null,null,null,null,null,null,null,null,null,null,null,null,null,null,null,null,0,0,0,0,null,999,null,0]
[296,96.567862714508593,120,2015,76,46,94,0,null,null,null,null,null,null,null,null,null,null,null,null,null,null,null,null,null,null,null,null,null,null,null,null,null,null,null,null,null,null,null,null,null,null,null,null,null,null,null,null,null,null,null,null,null,null,null,null,null,null,null,null,0,0,0,0,null,999,null,0]
[297,100,160,2015,76,56,94,0,null,null,null,null,null,null,null,null,null,null,null,null,null,null,null,null,null,null,null,null,null,null,null,null,null,null,null,null,null,null,null,null,null,null,null,null,null,null,null,null,null,null,null,null,null,null,null,null,null,null,null,null,0,0,0,0,null,999,null,0]
[298,88.095238095238088,0,2015,91,7,94,0,null,null,null,null,null,null,null,null,null,null,null,null,null,null,null,null,null,null,null,null,null,null,null,null,null,null,null,null,null,null,null,null,null,null,null,null,null,null,null,null,null,null,null,null,null,null,null,null,null,null,null,null,0,0,0,0,null,999,null,0]
[299,90.674603174603192,60,2015,91,27,94,0,null,null,null,null,null,null,null,null,null,null,null,null,null,null,null,null,null,null,null,null,null,null,null,null,null,null,null,null,null,null,null,null,null,null,null,null,null,null,null,null,null,null,null,null,null,null,null,null,null,null,null,null,88.413793103448299,57.468965517241401,0,87,null,57.468965517241401,null,0]
[300,99.007936507936506,120,2015,91,47,102,0,null,null,null,null,null,null,null,null,null,null,null,null,null,null,null,null,null,null,null,null,null,null,null,null,null,null,null,null,null,null,null,null,null,null,null,null,null,null,null,null,null,null,null,null,null,null,null,null,null,null,null,null,95.724137931034505,62.2206896551724,40,87,null,62.2206896551724,null,37.220363602009435]
[301,100,160,2015,91,57,102,0,null,null,null,null,null,null,null,null,null,null,null,null,null,null,null,null,null,null,null,null,null,null,null,null,null,null,null,null,null,null,null,null,null,null,null,null,null,null,null,null,null,null,null,null,null,null,null,null,null,null,null,null,98.482758620689694,64.013793103448293,80,87,null,64.013793103448293,null,74.44072720401887]
[302,96.786389413988658,0,2015,92,8,102,1,null,null,null,null,null,null,null,null,null,null,null,null,null,null,null,null,null,null,null,null,null,null,null,null,null,null,null,null,null,null,null,null,null,null,null,null,null,null,null,null,null,null,null,null,null,null,null,null,null,null,null,null,96.827586206896598,62.937931034482801,120,87,null,62.937931034482801,null,111.6610908060283]
[303,100,60,2015,92,28,102,1,null,null,null,null,null,null,null,null,null,null,null,null,null,null,null,null,null,null,null,null,null,null,null,null,null,null,null,null,null,null,null,null,null,null,null,null,null,null,null,null,null,null,null,null,null,null,null,null,null,null,null,null,{"$f":"_xlfn.NUMBERVALUE(IF(AND($G131>=($U$151-$Y$151),$G131<=($U$151+$Y$151)),B131,\"\"))","v":100},{"$f":"_xlfn.NUMBERVALUE(IFERROR(+BI304*$W$149,\"\"))","v":65},{"$f":"_xlfn.NUMBERVALUE(IF(AND($G131>=($U$151-$Y$151),$G131<=($U$151+$Y$151)),C131,\"\"))","v":160},{"$f":"_xlfn.NUMBERVALUE(IF(AND($G131>=($U$151-$Y$151),$G131<=($U$151+$Y$151)),G131,\"\"))","v":87},null,{"$f":"IF(BJ304=0,999,BJ304)","v":65},null,{"$f":"+BK304*$BP$172","v":148.88145440803774}]
[304,99.243856332703217,120,2015,92,48,69,1,null,null,null,null,null,null,null,null,null,null,null,null,null,null,null,null,null,null,null,null,null,null,null,null,null,null,null,null,null,null,null,null,null,null,null,null,null,null,null,null,null,null,null,null,null,null,null,null,null,null,null,null,0,0,0,0,null,999,null,0]
[305,98.67674858223063,160,2015,92,58,69,1,null,null,null,null,null,null,null,null,null,null,null,null,null,null,null,null,null,null,null,null,null,null,null,null,null,null,null,null,null,null,null,null,null,null,null,null,null,null,null,null,null,null,null,null,null,null,null,null,null,null,null,null,0,0,0,0,null,999,null,0]
[306,86.379928315412187,0,2015,93,9,69,0,null,null,null,null,null,null,null,null,null,null,null,null,null,null,null,null,null,null,null,null,null,null,null,null,null,null,null,null,null,null,null,null,null,null,null,null,null,null,null,null,null,null,null,null,null,null,null,null,null,null,null,null,0,0,0,0,null,999,null,0]
[307,96.057347670250905,60,2015,93,29,69,0,null,null,null,null,null,null,null,null,null,null,null,null,null,null,null,null,null,null,null,null,null,null,null,null,null,null,null,null,null,null,null,null,null,null,null,null,null,null,null,null,null,null,null,null,null,null,null,null,null,null,null,null,0,0,0,0,null,999,null,0]
[308,99.283154121863802,120,2015,93,49,252,0,null,null,null,null,null,null,null,null,null,null,null,null,null,null,null,null,null,null,null,null,null,null,null,null,null,null,null,null,null,null,null,null,null,null,null,null,null,null,null,null,null,null,null,null,null,null,null,null,null,null,null,null,0,0,0,0,null,999,null,0]
[309,100,160,2015,93,59,252,0,null,null,null,null,null,null,null,null,null,null,null,null,null,null,null,null,null,null,null,null,null,null,null,null,null,null,null,null,null,null,null,null,null,null,null,null,null,null,null,null,null,null,null,null,null,null,null,null,null,null,null,null,0,0,0,0,null,999,null,0]
[310,101.63636363636364,0,2015,95,10,252,1,null,null,null,null,null,null,null,null,null,null,null,null,null,null,null,null,null,null,null,null,null,null,null,null,null,null,null,null,null,null,null,null,null,null,null,null,null,null,null,null,null,null,null,null,null,null,null,null,null,null,null,null,0,0,0,0,null,999,null,0]
[311,100,60,2015,95,30,252,1,null,null,null,null,null,null,null,null,null,null,null,null,null,null,null,null,null,null,null,null,null,null,null,null,null,null,null,null,null,null,null,null,null,null,null,null,null,null,null,null,null,null,null,null,null,null,null,null,null,null,null,null,0,0,0,0,null,999,null,0]
[312,98.72727272727272,120,2015,95,50,51,1,null,null,null,null,null,null,null,null,null,null,null,null,null,null,null,null,null,null,null,null,null,null,null,null,null,null,null,null,null,null,null,null,null,null,null,null,null,null,null,null,null,null,null,null,null,null,null,null,null,null,null,null,0,0,0,0,null,999,null,0]
[313,97.27272727272728,160,2015,95,60,51,1,null,null,null,null,null,null,null,null,null,null,null,null,null,null,null,null,null,null,null,null,null,null,null,null,null,null,null,null,null,null,null,null,null,null,null,null,null,null,null,null,null,null,null,null,null,null,null,null,null,null,null,null,0,0,0,0,null,999,null,0]
[314,73.80952380952381,0,2016,96,1,51,0,null,null,null,null,null,null,null,null,null,null,null,null,null,null,null,null,null,null,null,null,null,null,null,null,null,null,null,null,null,null,null,null,null,null,null,null,null,null,null,null,null,null,null,null,null,null,null,null,null,null,null,null,0,0,0,0,null,999,null,0]
[315,87.857142857142861,40,2016,96,14,51,0,null,null,null,null,null,null,null,null,null,null,null,null,null,null,null,null,null,null,null,null,null,null,null,null,null,null,null,null,null,null,null,null,null,null,null,null,null,null,null,null,null,null,null,null,null,null,null,null,null,null,null,null,0,0,0,0,null,999,null,0]
[316,91.904761904761912,80,2016,96,31,247,0,null,null,null,null,null,null,null,null,null,null,null,null,null,null,null,null,null,null,null,null,null,null,null,null,null,null,null,null,null,null,null,null,null,null,null,null,null,null,null,null,null,null,null,null,null,null,null,null,null,null,null,null,0,0,0,0,null,999,null,0]
[317,99.880952380952394,120,2016,96,41,247,0,null,null,null,null,null,null,null,null,null,null,null,null,null,null,null,null,null,null,null,null,null,null,null,null,null,null,null,null,null,null,null,null,null,null,null,null,null,null,null,null,null,null,null,null,null,null,null,null,null,null,null,null,0,0,0,0,null,999,null,0]
[318,100,160,2016,96,52,247,0,null,null,null,null,null,null,null,null,null,null,null,null,null,null,null,null,null,null,null,null,null,null,null,null,null,null,null,null,null,null,null,null,null,null,null,null,null,null,null,null,null,null,null,null,null,null,null,null,null,null,null,null,0,0,0,0,null,999,null,0]
[319,58.591549295774648,0,2016,98,2,247,0,null,null,null,null,null,null,null,null,null,null,null,null,null,null,null,null,null,null,null,null,null,null,null,null,null,null,null,null,null,null,null,null,null,null,null,null,null,null,null,null,null,null,null,null,null,null,null,null,null,null,null,null,0,0,0,0,null,999,null,0]
[320,86.478873239436609,60,2016,98,23,57,0,null,null,null,null,null,null,null,null,null,null,null,null,null,null,null,null,null,null,null,null,null,null,null,null,null,null,null,null,null,null,null,null,null,null,null,null,null,null,null,null,null,null,null,null,null,null,null,null,null,null,null,null,0,0,0,0,null,999,null,0]
[321,87.605633802816911,120,2016,98,42,65,0,null,null,null,null,null,null,null,null,null,null,null,null,null,null,null,null,null,null,null,null,null,null,null,null,null,null,null,null,null,null,null,null,null,null,null,null,null,null,null,null,null,null,null,null,null,null,null,null,null,null,null,null,0,0,0,0,null,999,null,0]
[322,100,180,2016,98,62,80,0,null,null,null,null,null,null,null,null,null,null,null,null,null,null,null,null,null,null,null,null,null,null,null,null,null,null,null,null,null,null,null,null,null,null,null,null,null,null,null,null,null,null,null,null,null,null,null,null,null,null,null,null,0,0,0,0,null,999,null,0]
[323,89.172932330827052,0,2016,99,3,91,0,null,null,null,null,null,null,null,null,null,null,null,null,null,null,null,null,null,null,null,null,null,null,null,null,null,null,null,null,null,null,null,null,null,null,null,null,null,null,null,null,null,null,null,null,null,null,null,null,null,null,null,null,86.771653543307096,56.4015748031496,0,84,null,56.4015748031496,null,0]
[324,89.473684210526315,40,2016,99,15,106,0,null,null,null,null,null,null,null,null,null,null,null,null,null,null,null,null,null,null,null,null,null,null,null,null,null,null,null,null,null,null,null,null,null,null,null,null,null,null,null,null,null,null,null,null,null,null,null,null,null,null,null,null,92.755905511810994,60.291338582677099,60,84,null,60.291338582677099,null,55.830545403014149]
[325,97.593984962406026,80,2016,99,32,46,0,null,null,null,null,null,null,null,null,null,null,null,null,null,null,null,null,null,null,null,null,null,null,null,null,null,null,null,null,null,null,null,null,null,null,null,null,null,null,null,null,null,null,null,null,null,null,null,null,null,null,null,null,100,65,120,84,null,65,null,111.6610908060283]
[326,97.89473684210526,120,2016,99,43,46,0,null,null,null,null,null,null,null,null,null,null,null,null,null,null,null,null,null,null,null,null,null,null,null,null,null,null,null,null,null,null,null,null,null,null,null,null,null,null,null,null,null,null,null,null,null,null,null,null,null,null,null,null,66.213921901527996,43.039049235993197,0,85,null,43.039049235993197,null,0]
[327,100,160,2016,99,53,46,0,null,null,null,null,null,null,null,null,null,null,null,null,null,null,null,null,null,null,null,null,null,null,null,null,null,null,null,null,null,null,null,null,null,null,null,null,null,null,null,null,null,null,null,null,null,null,null,null,null,null,null,null,0,0,0,0,null,999,null,0]
[328,97.022767075306476,0,2017,100,1,46,1,null,null,null,null,null,null,null,null,null,null,null,null,null,null,null,null,null,null,null,null,null,null,null,null,null,null,null,null,null,null,null,null,null,null,null,null,null,null,null,null,null,null,null,null,null,null,null,null,null,null,null,null,0,0,0,0,null,999,null,0]
[329,100,60,2017,100,23,46,1,null,null,null,null,null,null,null,null,null,null,null,null,null,null,null,null,null,null,null,null,null,null,null,null,null,null,null,null,null,null,null,null,null,null,null,null,null,null,null,null,null,null,null,null,null,null,null,null,null,null,null,null,0,0,0,0,null,999,null,0]
[330,100,120,2017,100,41,46,1,null,null,null,null,null,null,null,null,null,null,null,null,null,null,null,null,null,null,null,null,null,null,null,null,null,null,null,null,null,null,null,null,null,null,null,null,null,null,null,null,null,null,null,null,null,null,null,null,null,null,null,null,0,0,0,0,null,999,null,0]
[331,87.408312958435204,0,2017,102,2,46,0,null,null,null,null,null,null,null,null,null,null,null,null,null,null,null,null,null,null,null,null,null,null,null,null,null,null,null,null,null,null,null,null,null,null,null,null,null,null,null,null,null,null,null,null,null,null,null,null,null,null,null,null,76.823338735818496,49.935170178282,0,81,null,49.935170178282,null,0]
[332,97.310513447432754,40,2017,102,14,46,0,null,null,null,null,null,null,null,null,null,null,null,null,null,null,null,null,null,null,null,null,null,null,null,null,null,null,null,null,null,null,null,null,null,null,null,null,null,null,null,null,null,null,null,null,null,null,null,null,null,null,null,null,0,0,0,0,null,999,null,0]
[333,95.965770171149146,80,2017,102,31,46,0,null,null,null,null,null,null,null,null,null,null,null,null,null,null,null,null,null,null,null,null,null,null,null,null,null,null,null,null,null,null,null,null,null,null,null,null,null,null,null,null,null,null,null,null,null,null,null,null,null,null,null,null,0,0,0,0,null,999,null,0]
[334,98.899755501222515,120,2017,102,42,185,0,null,null,null,null,null,null,null,null,null,null,null,null,null,null,null,null,null,null,null,null,null,null,null,null,null,null,null,null,null,null,null,null,null,null,null,null,null,null,null,null,null,null,null,null,null,null,null,null,null,null,null,null,0,0,0,0,null,999,null,0]
[335,100,160,2017,102,52,185,0,null,null,null,null,null,null,null,null,null,null,null,null,null,null,null,null,null,null,null,null,null,null,null,null,null,null,null,null,null,null,null,null,null,null,null,null,null,null,null,null,null,null,null,null,null,null,null,null,null,null,null,null,0,0,0,0,null,999,null,0]
[336,63.352272727272727,0,2017,104,3,185,0,null,null,null,null,null,null,null,null,null,null,null,null,null,null,null,null,null,null,null,null,null,null,null,null,null,null,null,null,null,null,null,null,null,null,null,null,null,null,null,null,null,null,null,null,null,null,null,null,null,null,null,null,78.633975481611202,51.112084063047298,0,73,null,51.112084063047298,null,0]
[337,85.22727272727272,60,2017,104,24,77,0,null,null,null,null,null,null,null,null,null,null,null,null,null,null,null,null,null,null,null,null,null,null,null,null,null,null,null,null,null,null,null,null,null,null,null,null,null,null,null,null,null,null,null,null,null,null,null,null,null,null,null,null,95.796847635726806,62.267950963222397,45,73,null,62.267950963222397,null,41.87290905226061]
[338,88.210227272727266,120,2017,104,43,77,0,null,null,null,null,null,null,null,null,null,null,null,null,null,null,null,null,null,null,null,null,null,null,null,null,null,null,null,null,null,null,null,null,null,null,null,null,null,null,null,null,null,null,null,null,null,null,null,null,null,null,null,null,100,65,90,73,null,65,null,83.74581810452122]
[339,100,180,2017,104,62,87,0,null,null,null,null,null,null,null,null,null,null,null,null,null,null,null,null,null,null,null,null,null,null,null,null,null,null,null,null,null,null,null,null,null,null,null,null,null,null,null,null,null,null,null,null,null,null,null,null,null,null,null,null,92.925430210325104,60.401529636711302,0,73,null,60.401529636711302,null,0]
[340,89.487870619946094,0,2017,105,4,106,0,null,null,null,null,null,null,null,null,null,null,null,null,null,null,null,null,null,null,null,null,null,null,null,null,null,null,null,null,null,null,null,null,null,null,null,null,null,null,null,null,null,null,null,null,null,null,null,null,null,null,null,null,0,0,0,0,null,999,null,0]
[341,96.765498652291086,60,2017,105,25,136,0,null,null,null,null,null,null,null,null,null,null,null,null,null,null,null,null,null,null,null,null,null,null,null,null,null,null,null,null,null,null,null,null,null,null,null,null,null,null,null,null,null,null,null,null,null,null,null,null,null,null,null,null,0,0,0,0,null,999,null,0]
[342,98.921832884097043,120,2017,105,44,51,0,null,null,null,null,null,null,null,null,null,null,null,null,null,null,null,null,null,null,null,null,null,null,null,null,null,null,null,null,null,null,null,null,null,null,null,null,null,null,null,null,null,null,null,null,null,null,null,null,null,null,null,null,0,0,0,0,null,999,null,0]
[343,100,180,2017,105,63,51,0,null,null,null,null,null,null,null,null,null,null,null,null,null,null,null,null,null,null,null,null,null,null,null,null,null,null,null,null,null,null,null,null,null,null,null,null,null,null,null,null,null,null,null,null,null,null,null,null,null,null,null,null,0,0,0,0,null,999,null,0]
[344,98.303030303030297,0,2018,101,1,51,1,null,null,null,null,null,null,null,null,null,null,null,null,null,null,null,null,null,null,null,null,null,null,null,null,null,null,null,null,null,null,null,null,null,null,null,null,null,null,null,null,null,null,null,null,null,null,null,null,null,null,null,null,0,0,0,0,null,999,null,0]
[345,99.27272727272728,60,2018,101,23,51,1,null,null,null,null,null,null,null,null,null,null,null,null,null,null,null,null,null,null,null,null,null,null,null,null,null,null,null,null,null,null,null,null,null,null,null,null,null,null,null,null,null,null,null,null,null,null,null,null,null,null,null,null,0,0,0,0,null,999,null,0]
[346,100,120,2018,101,41,63,1,null,null,null,null,null,null,null,null,null,null,null,null,null,null,null,null,null,null,null,null,null,null,null,null,null,null,null,null,null,null,null,null,null,null,null,null,null,null,null,null,null,null,null,null,null,null,null,null,null,null,null,null,95.945945945945894,62.364864864864799,80,63,null,62.364864864864799,null,74.44072720401887]
[347,81.699346405228752,0,2018,103,2,63,0,null,null,null,null,null,null,null,null,null,null,null,null,null,null,null,null,null,null,null,null,null,null,null,null,null,null,null,null,null,null,null,null,null,null,null,null,null,null,null,null,null,null,null,null,null,null,null,null,null,null,null,null,98.648648648648603,64.1216216216216,120,72,null,64.1216216216216,null,111.6610908060283]
[348,85.403050108932462,40,2018,103,14,63,0,null,null,null,null,null,null,null,null,null,null,null,null,null,null,null,null,null,null,null,null,null,null,null,null,null,null,null,null,null,null,null,null,null,null,null,null,null,null,null,null,null,null,null,null,null,null,null,null,null,null,null,null,100,65,160,83,null,65,null,148.88145440803774]
[349,93.246187363834423,80,2018,103,31,63,0,null,null,null,null,null,null,null,null,null,null,null,null,null,null,null,null,null,null,null,null,null,null,null,null,null,null,null,null,null,null,null,null,null,null,null,null,null,null,null,null,null,null,null,null,null,null,null,null,null,null,null,null,89.655172413793096,58.275862068965502,0,89,null,58.275862068965502,null,0]
[350,100,120,2018,103,42,241,0,null,null,null,null,null,null,null,null,null,null,null,null,null,null,null,null,null,null,null,null,null,null,null,null,null,null,null,null,null,null,null,null,null,null,null,null,null,null,null,null,null,null,null,null,null,null,null,null,null,null,null,null,0,0,0,0,null,999,null,0]
[351,100,160,2018,103,52,241,0,null,null,null,null,null,null,null,null,null,null,null,null,null,null,null,null,null,null,null,null,null,null,null,null,null,null,null,null,null,null,null,null,null,null,null,null,null,null,null,null,null,null,null,null,null,null,null,null,null,null,null,null,0,0,0,0,null,999,null,0]
[352,80.952380952380949,0,2018,106,3,241,0,null,null,null,null,null,null,null,null,null,null,null,null,null,null,null,null,null,null,null,null,null,null,null,null,null,null,null,null,null,null,null,null,null,null,null,null,null,null,null,null,null,null,null,null,null,null,null,null,null,null,null,null,0,0,0,0,null,999,null,0]
[353,95.238095238095227,60,2018,106,24,95,0,null,null,null,null,null,null,null,null,null,null,null,null,null,null,null,null,null,null,null,null,null,null,null,null,null,null,null,null,null,null,null,null,null,null,null,null,null,null,null,null,null,null,null,null,null,null,null,null,null,null,null,null,0,0,0,0,null,999,null,0]
[354,97.802197802197796,120,2018,106,43,106,0,null,null,null,null,null,null,null,null,null,null,null,null,null,null,null,null,null,null,null,null,null,null,null,null,null,null,null,null,null,null,null,null,null,null,null,null,null,null,null,null,null,null,null,null,null,null,null,null,null,null,null,null,0,0,0,0,null,999,null,0]
[355,100,180,2018,106,62,123,0,null,null,null,null,null,null,null,null,null,null,null,null,null,null,null,null,null,null,null,null,null,null,null,null,null,null,null,null,null,null,null,null,null,null,null,null,null,null,null,null,null,null,null,null,null,null,null,null,null,null,null,null,0,0,0,0,null,999,null,0]
[356,85.294117647058826,0,2018,107,4,138,0,null,null,null,null,null,null,null,null,null,null,null,null,null,null,null,null,null,null,null,null,null,null,null,null,null,null,null,null,null,null,null,null,null,null,null,null,null,null,null,null,null,null,null,null,null,null,null,null,null,null,null,null,0,0,0,0,null,999,null,0]
[357,95.855614973262036,60,2018,107,25,175,0,null,null,null,null,null,null,null,null,null,null,null,null,null,null,null,null,null,null,null,null,null,null,null,null,null,null,null,null,null,null,null,null,null,null,null,null,null,null,null,null,null,null,null,null,null,null,null,null,null,null,null,null,0,0,0,0,null,999,null,0]
[358,98.796791443850267,120,2018,107,44,69,0,null,null,null,null,null,null,null,null,null,null,null,null,null,null,null,null,null,null,null,null,null,null,null,null,null,null,null,null,null,null,null,null,null,null,null,null,null,null,null,null,null,null,null,null,null,null,null,null,null,null,null,null,0,0,0,0,null,999,null,0]
[359,100,180,2018,107,63,69,0,null,null,null,null,null,null,null,null,null,null,null,null,null,null,null,null,null,null,null,null,null,null,null,null,null,null,null,null,null,null,null,null,null,null,null,null,null,null,null,null,null,null,null,null,null,null,null,null,null,null,null,null,0,0,0,0,null,999,null,0]
[360,67.887931034482762,0,2018,108,5,69,0,null,null,null,null,null,null,null,null,null,null,null,null,null,null,null,null,null,null,null,null,null,null,null,null,null,null,null,null,null,null,null,null,null,null,null,null,null,null,null,null,null,null,null,null,null,null,null,null,null,null,null,null,100,65,80,72,null,65,null,74.44072720401887]
[361,84.698275862068968,40,2018,108,15,69,0,null,null,null,null,null,null,null,null,null,null,null,null,null,null,null,null,null,null,null,null,null,null,null,null,null,null,null,null,null,null,null,null,null,null,null,null,null,null,null,null,null,null,null,null,null,null,null,null,null,null,null,null,89.855072463768096,58.405797101449302,0,72,null,58.405797101449302,null,0]
[362,92.995689655172413,80,2018,108,32,66,0,null,null,null,null,null,null,null,null,null,null,null,null,null,null,null,null,null,null,null,null,null,null,null,null,null,null,null,null,null,null,null,null,null,null,null,null,null,null,null,null,null,null,null,null,null,null,null,null,null,null,null,null,100,65,80,72,null,65,null,74.44072720401887]
[363,100,120,2018,108,45,66,0,null,null,null,null,null,null,null,null,null,null,null,null,null,null,null,null,null,null,null,null,null,null,null,null,null,null,null,null,null,null,null,null,null,null,null,null,null,null,null,null,null,null,null,null,null,null,null,null,null,null,null,null,95.8333333333333,62.2916666666667,0,72,null,62.2916666666667,null,0]
[364,98.383620689655174,160,2018,108,53,66,0,null,null,null,null,null,null,null,null,null,null,null,null,null,null,null,null,null,null,null,null,null,null,null,null,null,null,null,null,null,null,null,null,null,null,null,null,null,null,null,null,null,null,null,null,null,null,null,null,null,null,null,null,0,0,0,0,null,999,null,0]
[365,60.75949367088608,0,2019,109,1,66,0,null,null,null,null,null,null,null,null,null,null,null,null,null,null,null,null,null,null,null,null,null,null,null,null,null,null,null,null,null,null,null,null,null,null,null,null,null,null,null,null,null,null,null,null,null,null,null,null,null,null,null,null,0,0,0,0,null,999,null,0]
[366,84.050632911392412,40,2019,109,14,52,0,null,null,null,null,null,null,null,null,null,null,null,null,null,null,null,null,null,null,null,null,null,null,null,null,null,null,null,null,null,null,null,null,null,null,null,null,null,null,null,null,null,null,null,null,null,null,null,null,null,null,null,null,0,0,0,0,null,999,null,0]
[367,94.303797468354432,80,2019,109,31,65,0,null,null,null,null,null,null,null,null,null,null,null,null,null,null,null,null,null,null,null,null,null,null,null,null,null,null,null,null,null,null,null,null,null,null,null,null,null,null,null,null,null,null,null,null,null,null,null,null,null,null,null,null,{"$f":"_xlfn.NUMBERVALUE(IF(AND($G195>=($U$151-$Y$151),$G195<=($U$151+$Y$151)),B195,\"\"))","v":99.847328244274806},{"$f":"_xlfn.NUMBERVALUE(IFERROR(+BI368*$W$149,\"\"))","v":64.900763358778605},{"$f":"_xlfn.NUMBERVALUE(IF(AND($G195>=($U$151-$Y$151),$G195<=($U$151+$Y$151)),C195,\"\"))","v":40},{"$f":"_xlfn.NUMBERVALUE(IF(AND($G195>=($U$151-$Y$151),$G195<=($U$151+$Y$151)),G195,\"\"))","v":64},null,{"$f":"IF(BJ368=0,999,BJ368)","v":64.900763358778605},null,{"$f":"+BK368*$BP$172","v":37.220363602009435}]
[368,96.455696202531655,120,2019,109,41,74,0,null,null,null,null,null,null,null,null,null,null,null,null,null,null,null,null,null,null,null,null,null,null,null,null,null,null,null,null,null,null,null,null,null,null,null,null,null,null,null,null,null,null,null,null,null,null,null,null,null,null,null,null,97.404580152671798,63.312977099236697,80,73,null,63.312977099236697,null,74.44072720401887]
[369,100,160,2019,109,52,85,0,null,null,null,null,null,null,null,null,null,null,null,null,null,null,null,null,null,null,null,null,null,null,null,null,null,null,null,null,null,null,null,null,null,null,null,null,null,null,null,null,null,null,null,null,null,null,null,null,null,null,null,null,100,65,120,78,null,65,null,111.6610908060283]
[370,82.575024201355276,0,2019,110,2,105,0,null,null,null,null,null,null,null,null,null,null,null,null,null,null,null,null,null,null,null,null,null,null,null,null,null,null,null,null,null,null,null,null,null,null,null,null,null,null,null,null,null,null,null,null,null,null,null,null,null,null,null,null,98.778625954198503,64.206106870228993,160,82,null,64.206106870228993,null,148.88145440803774]
[371,100,40,2019,110,15,50,0,null,null,null,null,null,null,null,null,null,null,null,null,null,null,null,null,null,null,null,null,null,null,null,null,null,null,null,null,null,null,null,null,null,null,null,null,null,null,null,null,null,null,null,null,null,null,null,null,null,null,null,null,0,0,0,0,null,999,null,0]
[372,97.192642787996135,80,2019,110,32,60,0,null,null,null,null,null,null,null,null,null,null,null,null,null,null,null,null,null,null,null,null,null,null,null,null,null,null,null,null,null,null,null,null,null,null,null,null,null,null,null,null,null,null,null,null,null,null,null,null,null,null,null,null,95.491803278688494,62.069672131147499,40,64,null,62.069672131147499,null,37.220363602009435]
[373,99.51597289448209,120,2019,110,42,71,0,null,null,null,null,null,null,null,null,null,null,null,null,null,null,null,null,null,null,null,null,null,null,null,null,null,null,null,null,null,null,null,null,null,null,null,null,null,null,null,null,null,null,null,null,null,null,null,null,null,null,null,null,96.311475409836106,62.602459016393503,80,71,null,62.602459016393503,null,74.44072720401887]
[374,98.354307841239105,160,2019,110,53,81,0,null,null,null,null,null,null,null,null,null,null,null,null,null,null,null,null,null,null,null,null,null,null,null,null,null,null,null,null,null,null,null,null,null,null,null,null,null,null,null,null,null,null,null,null,null,null,null,null,null,null,null,null,99.180327868852402,64.467213114754102,120,74,null,64.467213114754102,null,111.6610908060283]
[null,null,null,null,null,null,null,null,null,null,null,null,null,null,null,null,null,null,null,null,null,null,null,null,null,null,null,null,null,null,null,null,null,null,null,null,null,null,null,null,null,null,null,null,null,null,null,null,null,null,null,null,null,null,null,null,null,null,null,null,100,65,160,81,null,65,null,148.88145440803774]
[null,null,null,null,null,null,null,null,null,null,null,null,null,null,null,null,null,null,null,null,null,null,null,null,null,null,null,null,null,null,null,null,null,null,null,null,null,null,null,null,null,null,null,null,null,null,null,null,null,null,null,null,null,null,null,null,null,null,null,null,93.220338983050794,60.593220338983002,0,83,null,60.593220338983002,null,0]
[null,null,null,null,null,null,null,null,null,null,null,null,null,null,null,null,null,null,null,null,null,null,null,null,null,null,null,null,null,null,null,null,null,null,null,null,null,null,null,null,null,null,null,null,null,null,null,null,null,null,null,null,null,null,null,null,null,null,null,null,100,65,80,80,null,65,null,74.44072720401887]
[null,null,null,null,null,null,null,null,null,null,null,null,null,null,null,null,null,null,null,null,null,null,null,null,null,null,null,null,null,null,null,null,null,null,null,null,null,null,null,null,null,null,null,null,null,null,null,null,null,null,null,null,null,null,null,null,null,null,null,null,0,0,0,0,null,999,null,0]
[null,null,null,null,null,null,null,null,null,null,null,null,null,null,null,null,null,null,null,null,null,null,null,null,null,null,null,null,null,null,null,null,null,null,null,null,null,null,null,null,null,null,null,null,null,null,null,null,null,null,null,null,null,null,null,null,null,null,null,null,0,0,0,0,null,999,null,0]
[null,null,null,null,null,null,null,null,null,null,null,null,null,null,null,null,null,null,null,null,null,null,null,null,null,null,null,null,null,null,null,null,null,null,null,null,null,null,null,null,null,null,null,null,null,null,null,null,null,null,null,null,null,null,null,null,null,null,null,null,0,0,0,0,null,999,null,0]
[null,null,null,null,null,null,null,null,null,null,null,null,null,null,null,null,null,null,null,null,null,null,null,null,null,null,null,null,null,null,null,null,null,null,null,null,null,null,null,null,null,null,null,null,null,null,null,null,null,null,null,null,null,null,null,null,null,null,null,null,0,0,0,0,null,999,null,0]
[null,null,null,null,null,null,null,null,null,null,null,null,null,null,null,null,null,null,null,null,null,null,null,null,null,null,null,null,null,null,null,null,null,null,null,null,null,null,null,null,null,null,null,null,null,null,null,null,null,null,null,null,null,null,null,null,null,null,null,null,0,0,0,0,null,999,null,0]
[null,null,null,null,null,null,null,null,null,null,null,null,null,null,null,null,null,null,null,null,null,null,null,null,null,null,null,null,null,null,null,null,null,null,null,null,null,null,null,null,null,null,null,null,null,null,null,null,null,null,null,null,null,null,null,null,null,null,null,null,0,0,0,0,null,999,null,0]
[null,null,null,null,null,null,null,null,null,null,null,null,null,null,null,null,null,null,null,null,null,null,null,null,null,null,null,null,null,null,null,null,null,null,null,null,null,null,null,null,null,null,null,null,null,null,null,null,null,null,null,null,null,null,null,null,null,null,null,null,96.038251366120207,62.4248633879781,120,83,null,62.4248633879781,null,111.6610908060283]
[null,null,null,null,null,null,null,null,null,null,null,null,null,null,null,null,null,null,null,null,null,null,null,null,null,null,null,null,null,null,null,null,null,null,null,null,null,null,null,null,null,null,null,null,null,null,null,null,null,null,null,null,null,null,null,null,null,null,null,null,94.945355191256795,61.714480874316898,160,83,null,61.714480874316898,null,148.88145440803774]
[null,null,null,null,null,null,null,null,null,null,null,null,null,null,null,null,null,null,null,null,null,null,null,null,null,null,null,null,null,null,null,null,null,null,null,null,null,null,null,null,null,null,null,null,null,null,null,null,null,null,null,null,null,null,null,null,null,null,null,null,97.795071335927403,63.566796368352797,0,83,null,63.566796368352797,null,0]
[null,null,null,null,null,null,null,null,null,null,null,null,null,null,null,null,null,null,null,null,null,null,null,null,null,null,null,null,null,null,null,null,null,null,null,null,null,null,null,null,null,null,null,null,null,null,null,null,null,null,null,null,null,null,null,null,null,null,null,null,100,65,60,83,null,65,null,55.830545403014149]
[null,null,null,null,null,null,null,null,null,null,null,null,null,null,null,null,null,null,null,null,null,null,null,null,null,null,null,null,null,null,null,null,null,null,null,null,null,null,null,null,null,null,null,null,null,null,null,null,null,null,null,null,null,null,null,null,null,null,null,null,0,0,0,0,null,999,null,0]
[null,null,null,null,null,null,null,null,null,null,null,null,null,null,null,null,null,null,null,null,null,null,null,null,null,null,null,null,null,null,null,null,null,null,null,null,null,null,null,null,null,null,null,null,null,null,null,null,null,null,null,null,null,null,null,null,null,null,null,null,0,0,0,0,null,999,null,0]
[null,null,null,null,null,null,null,null,null,null,null,null,null,null,null,null,null,null,null,null,null,null,null,null,null,null,null,null,null,null,null,null,null,null,null,null,null,null,null,null,null,null,null,null,null,null,null,null,null,null,null,null,null,null,null,null,null,null,null,null,0,0,0,0,null,999,null,0]
[null,null,null,null,null,null,null,null,null,null,null,null,null,null,null,null,null,null,null,null,null,null,null,null,null,null,null,null,null,null,null,null,null,null,null,null,null,null,null,null,null,null,null,null,null,null,null,null,null,null,null,null,null,null,null,null,null,null,null,null,0,0,0,0,null,999,null,0]
[null,null,null,null,null,null,null,null,null,null,null,null,null,null,null,null,null,null,null,null,null,null,null,null,null,null,null,null,null,null,null,null,null,null,null,null,null,null,null,null,null,null,null,null,null,null,null,null,null,null,null,null,null,null,null,null,null,null,null,null,0,0,0,0,null,999,null,0]
[null,null,null,null,null,null,null,null,null,null,null,null,null,null,null,null,null,null,null,null,null,null,null,null,null,null,null,null,null,null,null,null,null,null,null,null,null,null,null,null,null,null,null,null,null,null,null,null,null,null,null,null,null,null,null,null,null,null,null,null,0,0,0,0,null,999,null,0]
[null,null,null,null,null,null,null,null,null,null,null,null,null,null,null,null,null,null,null,null,null,null,null,null,null,null,null,null,null,null,null,null,null,null,null,null,null,null,null,null,null,null,null,null,null,null,null,null,null,null,null,null,null,null,null,null,null,null,null,null,0,0,0,0,null,999,null,0]
[null,null,null,null,null,null,null,null,null,null,null,null,null,null,null,null,null,null,null,null,null,null,null,null,null,null,null,null,null,null,null,null,null,null,null,null,null,null,null,null,null,null,null,null,null,null,null,null,null,null,null,null,null,null,null,null,null,null,null,null,0,0,0,0,null,999,null,0]
[null,null,null,null,null,null,null,null,null,null,null,null,null,null,null,null,null,null,null,null,null,null,null,null,null,null,null,null,null,null,null,null,null,null,null,null,null,null,null,null,null,null,null,null,null,null,null,null,null,null,null,null,null,null,null,null,null,null,null,null,0,0,0,0,null,999,null,0]
[null,null,null,null,null,null,null,null,null,null,null,null,null,null,null,null,null,null,null,null,null,null,null,null,null,null,null,null,null,null,null,null,null,null,null,null,null,null,null,null,null,null,null,null,null,null,null,null,null,null,null,null,null,null,null,null,null,null,null,null,0,0,0,0,null,999,null,0]
[null,null,null,null,null,null,null,null,null,null,null,null,null,null,null,null,null,null,null,null,null,null,null,null,null,null,null,null,null,null,null,null,null,null,null,null,null,null,null,null,null,null,null,null,null,null,null,null,null,null,null,null,null,null,null,null,null,null,null,null,0,0,0,0,null,999,null,0]
[null,null,null,null,null,null,null,null,null,null,null,null,null,null,null,null,null,null,null,null,null,null,null,null,null,null,null,null,null,null,null,null,null,null,null,null,null,null,null,null,null,null,null,null,null,null,null,null,null,null,null,null,null,null,null,null,null,null,null,null,0,0,0,0,null,999,null,0]
[null,null,null,null,null,null,null,null,null,null,null,null,null,null,null,null,null,null,null,null,null,null,null,null,null,null,null,null,null,null,null,null,null,null,null,null,null,null,null,null,null,null,null,null,null,null,null,null,null,null,null,null,null,null,null,null,null,null,null,null,0,0,0,0,null,999,null,0]
[null,null,null,null,null,null,null,null,null,null,null,null,null,null,null,null,null,null,null,null,null,null,null,null,null,null,null,null,null,null,null,null,null,null,null,null,null,null,null,null,null,null,null,null,null,null,null,null,null,null,null,null,null,null,null,null,null,null,null,null,0,0,0,0,null,999,null,0]
[null,null,null,null,null,null,null,null,null,null,null,null,null,null,null,null,null,null,null,null,null,null,null,null,null,null,null,null,null,null,null,null,null,null,null,null,null,null,null,null,null,null,null,null,null,null,null,null,null,null,null,null,null,null,null,null,null,null,null,null,0,0,0,0,null,999,null,0]
[null,null,null,null,null,null,null,null,null,null,null,null,null,null,null,null,null,null,null,null,null,null,null,null,null,null,null,null,null,null,null,null,null,null,null,null,null,null,null,null,null,null,null,null,null,null,null,null,null,null,null,null,null,null,null,null,null,null,null,null,0,0,0,0,null,999,null,0]
[null,null,null,null,null,null,null,null,null,null,null,null,null,null,null,null,null,null,null,null,null,null,null,null,null,null,null,null,null,null,null,null,null,null,null,null,null,null,null,null,null,null,null,null,null,null,null,null,null,null,null,null,null,null,null,null,null,null,null,null,0,0,0,0,null,999,null,0]
[null,null,null,null,null,null,null,null,null,null,null,null,null,null,null,null,null,null,null,null,null,null,null,null,null,null,null,null,null,null,null,null,null,null,null,null,null,null,null,null,null,null,null,null,null,null,null,null,null,null,null,null,null,null,null,null,null,null,null,null,0,0,0,0,null,999,null,0]
[null,null,null,null,null,null,null,null,null,null,null,null,null,null,null,null,null,null,null,null,null,null,null,null,null,null,null,null,null,null,null,null,null,null,null,null,null,null,null,null,null,null,null,null,null,null,null,null,null,null,null,null,null,null,null,null,null,null,null,null,0,0,0,0,null,999,null,0]
[null,null,null,null,null,null,null,null,null,null,null,null,null,null,null,null,null,null,null,null,null,null,null,null,null,null,null,null,null,null,null,null,null,null,null,null,null,null,null,null,null,null,null,null,null,null,null,null,null,null,null,null,null,null,null,null,null,null,null,null,0,0,0,0,null,999,null,0]
[null,null,null,null,null,null,null,null,null,null,null,null,null,null,null,null,null,null,null,null,null,null,null,null,null,null,null,null,null,null,null,null,null,null,null,null,null,null,null,null,null,null,null,null,null,null,null,null,null,null,null,null,null,null,null,null,null,null,null,null,0,0,0,0,null,999,null,0]
[null,null,null,null,null,null,null,null,null,null,null,null,null,null,null,null,null,null,null,null,null,null,null,null,null,null,null,null,null,null,null,null,null,null,null,null,null,null,null,null,null,null,null,null,null,null,null,null,null,null,null,null,null,null,null,null,null,null,null,null,0,0,0,0,null,999,null,0]
[null,null,null,null,null,null,null,null,null,null,null,null,null,null,null,null,null,null,null,null,null,null,null,null,null,null,null,null,null,null,null,null,null,null,null,null,null,null,null,null,null,null,null,null,null,null,null,null,null,null,null,null,null,null,null,null,null,null,null,null,0,0,0,0,null,999,null,0]
[null,null,null,null,null,null,null,null,null,null,null,null,null,null,null,null,null,null,null,null,null,null,null,null,null,null,null,null,null,null,null,null,null,null,null,null,null,null,null,null,null,null,null,null,null,null,null,null,null,null,null,null,null,null,null,null,null,null,null,null,0,0,0,0,null,999,null,0]
[null,null,null,null,null,null,null,null,null,null,null,null,null,null,null,null,null,null,null,null,null,null,null,null,null,null,null,null,null,null,null,null,null,null,null,null,null,null,null,null,null,null,null,null,null,null,null,null,null,null,null,null,null,null,null,null,null,null,null,null,0,0,0,0,null,999,null,0]
[null,null,null,null,null,null,null,null,null,null,null,null,null,null,null,null,null,null,null,null,null,null,null,null,null,null,null,null,null,null,null,null,null,null,null,null,null,null,null,null,null,null,null,null,null,null,null,null,null,null,null,null,null,null,null,null,null,null,null,null,0,0,0,0,null,999,null,0]
[null,null,null,null,null,null,null,null,null,null,null,null,null,null,null,null,null,null,null,null,null,null,null,null,null,null,null,null,null,null,null,null,null,null,null,null,null,null,null,null,null,null,null,null,null,null,null,null,null,null,null,null,null,null,null,null,null,null,null,null,0,0,0,0,null,999,null,0]
[null,null,null,null,null,null,null,null,null,null,null,null,null,null,null,null,null,null,null,null,null,null,null,null,null,null,null,null,null,null,null,null,null,null,null,null,null,null,null,null,null,null,null,null,null,null,null,null,null,null,null,null,null,null,null,null,null,null,null,null,89.176829268292707,57.964939024390297,60,73,null,57.964939024390297,null,55.830545403014149]
[null,null,null,null,null,null,null,null,null,null,null,null,null,null,null,null,null,null,null,null,null,null,null,null,null,null,null,null,null,null,null,null,null,null,null,null,null,null,null,null,null,null,null,null,null,null,null,null,null,null,null,null,null,null,null,null,null,null,null,null,97.408536585365894,63.315548780487802,120,83,null,63.315548780487802,null,111.6610908060283]
[null,null,null,null,null,null,null,null,null,null,null,null,null,null,null,null,null,null,null,null,null,null,null,null,null,null,null,null,null,null,null,null,null,null,null,null,null,null,null,null,null,null,null,null,null,null,null,null,null,null,null,null,null,null,null,null,null,null,null,null,100,65,160,87,null,65,null,148.88145440803774]
[null,null,null,null,null,null,null,null,null,null,null,null,null,null,null,null,null,null,null,null,null,null,null,null,null,null,null,null,null,null,null,null,null,null,null,null,null,null,null,null,null,null,null,null,null,null,null,null,null,null,null,null,null,null,null,null,null,null,null,null,0,0,0,0,null,999,null,0]
[null,null,null,null,null,null,null,null,null,null,null,null,null,null,null,null,null,null,null,null,null,null,null,null,null,null,null,null,null,null,null,null,null,null,null,null,null,null,null,null,null,null,null,null,null,null,null,null,null,null,null,null,null,null,null,null,null,null,null,null,0,0,0,0,null,999,null,0]
[null,null,null,null,null,null,null,null,null,null,null,null,null,null,null,null,null,null,null,null,null,null,null,null,null,null,null,null,null,null,null,null,null,null,null,null,null,null,null,null,null,null,null,null,null,null,null,null,null,null,null,null,null,null,null,null,null,null,null,null,98.639455782312893,64.115646258503403,120,60,null,64.115646258503403,null,111.6610908060283]
[null,null,null,null,null,null,null,null,null,null,null,null,null,null,null,null,null,null,null,null,null,null,null,null,null,null,null,null,null,null,null,null,null,null,null,null,null,null,null,null,null,null,null,null,null,null,null,null,null,null,null,null,null,null,null,null,null,null,null,null,100,65,160,60,null,65,null,148.88145440803774]
[null,null,null,null,null,null,null,null,null,null,null,null,null,null,null,null,null,null,null,null,null,null,null,null,null,null,null,null,null,null,null,null,null,null,null,null,null,null,null,null,null,null,null,null,null,null,null,null,null,null,null,null,null,null,null,null,null,null,null,null,94.182389937106905,61.218553459119498,0,60,null,61.218553459119498,null,0]
[null,null,null,null,null,null,null,null,null,null,null,null,null,null,null,null,null,null,null,null,null,null,null,null,null,null,null,null,null,null,null,null,null,null,null,null,null,null,null,null,null,null,null,null,null,null,null,null,null,null,null,null,null,null,null,null,null,null,null,null,96.698113207547195,62.853773584905703,60,60,null,62.853773584905703,null,55.830545403014149]
[null,null,null,null,null,null,null,null,null,null,null,null,null,null,null,null,null,null,null,null,null,null,null,null,null,null,null,null,null,null,null,null,null,null,null,null,null,null,null,null,null,null,null,null,null,null,null,null,null,null,null,null,null,null,null,null,null,null,null,null,99.371069182389903,64.591194968553395,120,78,null,64.591194968553395,null,111.6610908060283]
[null,null,null,null,null,null,null,null,null,null,null,null,null,null,null,null,null,null,null,null,null,null,null,null,null,null,null,null,null,null,null,null,null,null,null,null,null,null,null,null,null,null,null,null,null,null,null,null,null,null,null,null,null,null,null,null,null,null,null,null,100,65,160,78,null,65,null,148.88145440803774]
[null,null,null,null,null,null,null,null,null,null,null,null,null,null,null,null,null,null,null,null,null,null,null,null,null,null,null,null,null,null,null,null,null,null,null,null,null,null,null,null,null,null,null,null,null,null,null,null,null,null,null,null,null,null,null,null,null,null,null,null,93.287435456110202,60.636833046471601,0,78,null,60.636833046471601,null,0]
[null,null,null,null,null,null,null,null,null,null,null,null,null,null,null,null,null,null,null,null,null,null,null,null,null,null,null,null,null,null,null,null,null,null,null,null,null,null,null,null,null,null,null,null,null,null,null,null,null,null,null,null,null,null,null,null,null,null,null,null,100,65,60,78,null,65,null,55.830545403014149]
[null,null,null,null,null,null,null,null,null,null,null,null,null,null,null,null,null,null,null,null,null,null,null,null,null,null,null,null,null,null,null,null,null,null,null,null,null,null,null,null,null,null,null,null,null,null,null,null,null,null,null,null,null,null,null,null,null,null,null,null,97.934595524957004,63.657487091222102,120,76,null,63.657487091222102,null,111.6610908060283]
[null,null,null,null,null,null,null,null,null,null,null,null,null,null,null,null,null,null,null,null,null,null,null,null,null,null,null,null,null,null,null,null,null,null,null,null,null,null,null,null,null,null,null,null,null,null,null,null,null,null,null,null,null,null,null,null,null,null,null,null,97.590361445783103,63.433734939758999,160,76,null,63.433734939758999,null,148.88145440803774]
[null,null,null,null,null,null,null,null,null,null,null,null,null,null,null,null,null,null,null,null,null,null,null,null,null,null,null,null,null,null,null,null,null,null,null,null,null,null,null,null,null,null,null,null,null,null,null,null,null,null,null,null,null,null,null,null,null,null,null,null,97.025495750708203,63.066572237960301,0,76,null,63.066572237960301,null,0]
[null,null,null,null,null,null,null,null,null,null,null,null,null,null,null,null,null,null,null,null,null,null,null,null,null,null,null,null,null,null,null,null,null,null,null,null,null,null,null,null,null,null,null,null,null,null,null,null,null,null,null,null,null,null,null,null,null,null,null,null,{"$f":"_xlfn.NUMBERVALUE(IF(AND($G259>=($U$151-$Y$151),$G259<=($U$151+$Y$151)),B259,\"\"))","v":100},{"$f":"_xlfn.NUMBERVALUE(IFERROR(+BI432*$W$149,\"\"))","v":65},{"$f":"_xlfn.NUMBERVALUE(IF(AND($G259>=($U$151-$Y$151),$G259<=($U$151+$Y$151)),C259,\"\"))","v":60},{"$f":"_xlfn.NUMBERVALUE(IF(AND($G259>=($U$151-$Y$151),$G259<=($U$151+$Y$151)),G259,\"\"))","v":76},null,{"$f":"IF(BJ432=0,999,BJ432)","v":65},null,{"$f":"+BK432*$BP$172","v":55.830545403014149}]
[null,null,null,null,null,null,null,null,null,null,null,null,null,null,null,null,null,null,null,null,null,null,null,null,null,null,null,null,null,null,null,null,null,null,null,null,null,null,null,null,null,null,null,null,null,null,null,null,null,null,null,null,null,null,null,null,null,null,null,null,95.750708215297493,62.237960339943399,120,72,null,62.237960339943399,null,111.6610908060283]
[null,null,null,null,null,null,null,null,null,null,null,null,null,null,null,null,null,null,null,null,null,null,null,null,null,null,null,null,null,null,null,null,null,null,null,null,null,null,null,null,null,null,null,null,null,null,null,null,null,null,null,null,null,null,null,null,null,null,null,null,95.892351274787501,62.330028328611903,160,72,null,62.330028328611903,null,148.88145440803774]
[null,null,null,null,null,null,null,null,null,null,null,null,null,null,null,null,null,null,null,null,null,null,null,null,null,null,null,null,null,null,null,null,null,null,null,null,null,null,null,null,null,null,null,null,null,null,null,null,null,null,null,null,null,null,null,null,null,null,null,null,90.619765494137397,58.902847571189298,0,72,null,58.902847571189298,null,0]
[null,null,null,null,null,null,null,null,null,null,null,null,null,null,null,null,null,null,null,null,null,null,null,null,null,null,null,null,null,null,null,null,null,null,null,null,null,null,null,null,null,null,null,null,null,null,null,null,null,null,null,null,null,null,null,null,null,null,null,null,100,65,60,72,null,65,null,55.830545403014149]
[null,null,null,null,null,null,null,null,null,null,null,null,null,null,null,null,null,null,null,null,null,null,null,null,null,null,null,null,null,null,null,null,null,null,null,null,null,null,null,null,null,null,null,null,null,null,null,null,null,null,null,null,null,null,null,null,null,null,null,null,0,0,0,0,null,999,null,0]
[null,null,null,null,null,null,null,null,null,null,null,null,null,null,null,null,null,null,null,null,null,null,null,null,null,null,null,null,null,null,null,null,null,null,null,null,null,null,null,null,null,null,null,null,null,null,null,null,null,null,null,null,null,null,null,null,null,null,null,null,0,0,0,0,null,999,null,0]
[null,null,null,null,null,null,null,null,null,null,null,null,null,null,null,null,null,null,null,null,null,null,null,null,null,null,null,null,null,null,null,null,null,null,null,null,null,null,null,null,null,null,null,null,null,null,null,null,null,null,null,null,null,null,null,null,null,null,null,null,0,0,0,0,null,999,null,0]
[null,null,null,null,null,null,null,null,null,null,null,null,null,null,null,null,null,null,null,null,null,null,null,null,null,null,null,null,null,null,null,null,null,null,null,null,null,null,null,null,null,null,null,null,null,null,null,null,null,null,null,null,null,null,null,null,null,null,null,null,0,0,0,0,null,999,null,0]
[null,null,null,null,null,null,null,null,null,null,null,null,null,null,null,null,null,null,null,null,null,null,null,null,null,null,null,null,null,null,null,null,null,null,null,null,null,null,null,null,null,null,null,null,null,null,null,null,null,null,null,null,null,null,null,null,null,null,null,null,0,0,0,0,null,999,null,0]
[null,null,null,null,null,null,null,null,null,null,null,null,null,null,null,null,null,null,null,null,null,null,null,null,null,null,null,null,null,null,null,null,null,null,null,null,null,null,null,null,null,null,null,null,null,null,null,null,null,null,null,null,null,null,null,null,null,null,null,null,0,0,0,0,null,999,null,0]
[null,null,null,null,null,null,null,null,null,null,null,null,null,null,null,null,null,null,null,null,null,null,null,null,null,null,null,null,null,null,null,null,null,null,null,null,null,null,null,null,null,null,null,null,null,null,null,null,null,null,null,null,null,null,null,null,null,null,null,null,0,0,0,0,null,999,null,0]
[null,null,null,null,null,null,null,null,null,null,null,null,null,null,null,null,null,null,null,null,null,null,null,null,null,null,null,null,null,null,null,null,null,null,null,null,null,null,null,null,null,null,null,null,null,null,null,null,null,null,null,null,null,null,null,null,null,null,null,null,0,0,0,0,null,999,null,0]
[null,null,null,null,null,null,null,null,null,null,null,null,null,null,null,null,null,null,null,null,null,null,null,null,null,null,null,null,null,null,null,null,null,null,null,null,null,null,null,null,null,null,null,null,null,null,null,null,null,null,null,null,null,null,null,null,null,null,null,null,0,0,0,0,null,999,null,0]
[null,null,null,null,null,null,null,null,null,null,null,null,null,null,null,null,null,null,null,null,null,null,null,null,null,null,null,null,null,null,null,null,null,null,null,null,null,null,null,null,null,null,null,null,null,null,null,null,null,null,null,null,null,null,null,null,null,null,null,null,0,0,0,0,null,999,null,0]
[null,null,null,null,null,null,null,null,null,null,null,null,null,null,null,null,null,null,null,null,null,null,null,null,null,null,null,null,null,null,null,null,null,null,null,null,null,null,null,null,null,null,null,null,null,null,null,null,null,null,null,null,null,null,null,null,null,null,null,null,0,0,0,0,null,999,null,0]
[null,null,null,null,null,null,null,null,null,null,null,null,null,null,null,null,null,null,null,null,null,null,null,null,null,null,null,null,null,null,null,null,null,null,null,null,null,null,null,null,null,null,null,null,null,null,null,null,null,null,null,null,null,null,null,null,null,null,null,null,0,0,0,0,null,999,null,0]
[null,null,null,null,null,null,null,null,null,null,null,null,null,null,null,null,null,null,null,null,null,null,null,null,null,null,null,null,null,null,null,null,null,null,null,null,null,null,null,null,null,null,null,null,null,null,null,null,null,null,null,null,null,null,null,null,null,null,null,null,0,0,0,0,null,999,null,0]
[null,null,null,null,null,null,null,null,null,null,null,null,null,null,null,null,null,null,null,null,null,null,null,null,null,null,null,null,null,null,null,null,null,null,null,null,null,null,null,null,null,null,null,null,null,null,null,null,null,null,null,null,null,null,null,null,null,null,null,null,0,0,0,0,null,999,null,0]
[null,null,null,null,null,null,null,null,null,null,null,null,null,null,null,null,null,null,null,null,null,null,null,null,null,null,null,null,null,null,null,null,null,null,null,null,null,null,null,null,null,null,null,null,null,null,null,null,null,null,null,null,null,null,null,null,null,null,null,null,0,0,0,0,null,999,null,0]
[null,null,null,null,null,null,null,null,null,null,null,null,null,null,null,null,null,null,null,null,null,null,null,null,null,null,null,null,null,null,null,null,null,null,null,null,null,null,null,null,null,null,null,null,null,null,null,null,null,null,null,null,null,null,null,null,null,null,null,null,0,0,0,0,null,999,null,0]
[null,null,null,null,null,null,null,null,null,null,null,null,null,null,null,null,null,null,null,null,null,null,null,null,null,null,null,null,null,null,null,null,null,null,null,null,null,null,null,null,null,null,null,null,null,null,null,null,null,null,null,null,null,null,null,null,null,null,null,null,0,0,0,0,null,999,null,0]
[null,null,null,null,null,null,null,null,null,null,null,null,null,null,null,null,null,null,null,null,null,null,null,null,null,null,null,null,null,null,null,null,null,null,null,null,null,null,null,null,null,null,null,null,null,null,null,null,null,null,null,null,null,null,null,null,null,null,null,null,0,0,0,0,null,999,null,0]
[null,null,null,null,null,null,null,null,null,null,null,null,null,null,null,null,null,null,null,null,null,null,null,null,null,null,null,null,null,null,null,null,null,null,null,null,null,null,null,null,null,null,null,null,null,null,null,null,null,null,null,null,null,null,null,null,null,null,null,null,0,0,0,0,null,999,null,0]
[null,null,null,null,null,null,null,null,null,null,null,null,null,null,null,null,null,null,null,null,null,null,null,null,null,null,null,null,null,null,null,null,null,null,null,null,null,null,null,null,null,null,null,null,null,null,null,null,null,null,null,null,null,null,null,null,null,null,null,null,0,0,0,0,null,999,null,0]
[null,null,null,null,null,null,null,null,null,null,null,null,null,null,null,null,null,null,null,null,null,null,null,null,null,null,null,null,null,null,null,null,null,null,null,null,null,null,null,null,null,null,null,null,null,null,null,null,null,null,null,null,null,null,null,null,null,null,null,null,69.749216300940404,45.336990595611297,0,64,null,45.336990595611297,null,0]
[null,null,null,null,null,null,null,null,null,null,null,null,null,null,null,null,null,null,null,null,null,null,null,null,null,null,null,null,null,null,null,null,null,null,null,null,null,null,null,null,null,null,null,null,null,null,null,null,null,null,null,null,null,null,null,null,null,null,null,null,88.087774294670893,57.257053291536103,60,86,null,57.257053291536103,null,55.830545403014149]
[null,null,null,null,null,null,null,null,null,null,null,null,null,null,null,null,null,null,null,null,null,null,null,null,null,null,null,null,null,null,null,null,null,null,null,null,null,null,null,null,null,null,null,null,null,null,null,null,null,null,null,null,null,null,null,null,null,null,null,null,0,0,0,0,null,999,null,0]
[null,null,null,null,null,null,null,null,null,null,null,null,null,null,null,null,null,null,null,null,null,null,null,null,null,null,null,null,null,null,null,null,null,null,null,null,null,null,null,null,null,null,null,null,null,null,null,null,null,null,null,null,null,null,null,null,null,null,null,null,0,0,0,0,null,999,null,0]
[null,null,null,null,null,null,null,null,null,null,null,null,null,null,null,null,null,null,null,null,null,null,null,null,null,null,null,null,null,null,null,null,null,null,null,null,null,null,null,null,null,null,null,null,null,null,null,null,null,null,null,null,null,null,null,null,null,null,null,null,0,0,0,0,null,999,null,0]
[null,null,null,null,null,null,null,null,null,null,null,null,null,null,null,null,null,null,null,null,null,null,null,null,null,null,null,null,null,null,null,null,null,null,null,null,null,null,null,null,null,null,null,null,null,null,null,null,null,null,null,null,null,null,null,null,null,null,null,null,0,0,0,0,null,999,null,0]
[null,null,null,null,null,null,null,null,null,null,null,null,null,null,null,null,null,null,null,null,null,null,null,null,null,null,null,null,null,null,null,null,null,null,null,null,null,null,null,null,null,null,null,null,null,null,null,null,null,null,null,null,null,null,null,null,null,null,null,null,0,0,0,0,null,999,null,0]
[null,null,null,null,null,null,null,null,null,null,null,null,null,null,null,null,null,null,null,null,null,null,null,null,null,null,null,null,null,null,null,null,null,null,null,null,null,null,null,null,null,null,null,null,null,null,null,null,null,null,null,null,null,null,null,null,null,null,null,null,0,0,0,0,null,999,null,0]
[null,null,null,null,null,null,null,null,null,null,null,null,null,null,null,null,null,null,null,null,null,null,null,null,null,null,null,null,null,null,null,null,null,null,null,null,null,null,null,null,null,null,null,null,null,null,null,null,null,null,null,null,null,null,null,null,null,null,null,null,0,0,0,0,null,999,null,0]
[null,null,null,null,null,null,null,null,null,null,null,null,null,null,null,null,null,null,null,null,null,null,null,null,null,null,null,null,null,null,null,null,null,null,null,null,null,null,null,null,null,null,null,null,null,null,null,null,null,null,null,null,null,null,null,null,null,null,null,null,98.487712665406406,64.017013232514202,120,88,null,64.017013232514202,null,111.6610908060283]
[null,null,null,null,null,null,null,null,null,null,null,null,null,null,null,null,null,null,null,null,null,null,null,null,null,null,null,null,null,null,null,null,null,null,null,null,null,null,null,null,null,null,null,null,null,null,null,null,null,null,null,null,null,null,null,null,null,null,null,null,100,65,160,88,null,65,null,148.88145440803774]
[null,null,null,null,null,null,null,null,null,null,null,null,null,null,null,null,null,null,null,null,null,null,null,null,null,null,null,null,null,null,null,null,null,null,null,null,null,null,null,null,null,null,null,null,null,null,null,null,null,null,null,null,null,null,null,null,null,null,null,null,97.035881435257394,63.0733229329173,0,88,null,63.0733229329173,null,0]
[null,null,null,null,null,null,null,null,null,null,null,null,null,null,null,null,null,null,null,null,null,null,null,null,null,null,null,null,null,null,null,null,null,null,null,null,null,null,null,null,null,null,null,null,null,null,null,null,null,null,null,null,null,null,null,null,null,null,null,null,92.355694227769106,60.031201248049904,60,88,null,60.031201248049904,null,55.830545403014149]
[null,null,null,null,null,null,null,null,null,null,null,null,null,null,null,null,null,null,null,null,null,null,null,null,null,null,null,null,null,null,null,null,null,null,null,null,null,null,null,null,null,null,null,null,null,null,null,null,null,null,null,null,null,null,null,null,null,null,null,null,0,0,0,0,null,999,null,0]
[null,null,null,null,null,null,null,null,null,null,null,null,null,null,null,null,null,null,null,null,null,null,null,null,null,null,null,null,null,null,null,null,null,null,null,null,null,null,null,null,null,null,null,null,null,null,null,null,null,null,null,null,null,null,null,null,null,null,null,null,0,0,0,0,null,999,null,0]
[null,null,null,null,null,null,null,null,null,null,null,null,null,null,null,null,null,null,null,null,null,null,null,null,null,null,null,null,null,null,null,null,null,null,null,null,null,null,null,null,null,null,null,null,null,null,null,null,null,null,null,null,null,null,null,null,null,null,null,null,0,0,0,0,null,999,null,0]
[null,null,null,null,null,null,null,null,null,null,null,null,null,null,null,null,null,null,null,null,null,null,null,null,null,null,null,null,null,null,null,null,null,null,null,null,null,null,null,null,null,null,null,null,null,null,null,null,null,null,null,null,null,null,null,null,null,null,null,null,0,0,0,0,null,999,null,0]
[null,null,null,null,null,null,null,null,null,null,null,null,null,null,null,null,null,null,null,null,null,null,null,null,null,null,null,null,null,null,null,null,null,null,null,null,null,null,null,null,null,null,null,null,null,null,null,null,null,null,null,null,null,null,null,null,null,null,null,null,0,0,0,0,null,999,null,0]
[null,null,null,null,null,null,null,null,null,null,null,null,null,null,null,null,null,null,null,null,null,null,null,null,null,null,null,null,null,null,null,null,null,null,null,null,null,null,null,null,null,null,null,null,null,null,null,null,null,null,null,null,null,null,null,null,null,null,null,null,0,0,0,0,null,999,null,0]
[null,null,null,null,null,null,null,null,null,null,null,null,null,null,null,null,null,null,null,null,null,null,null,null,null,null,null,null,null,null,null,null,null,null,null,null,null,null,null,null,null,null,null,null,null,null,null,null,null,null,null,null,null,null,null,null,null,null,null,null,0,0,0,0,null,999,null,0]
[null,null,null,null,null,null,null,null,null,null,null,null,null,null,null,null,null,null,null,null,null,null,null,null,null,null,null,null,null,null,null,null,null,null,null,null,null,null,null,null,null,null,null,null,null,null,null,null,null,null,null,null,null,null,null,null,null,null,null,null,0,0,0,0,null,999,null,0]
[null,null,null,null,null,null,null,null,null,null,null,null,null,null,null,null,null,null,null,null,null,null,null,null,null,null,null,null,null,null,null,null,null,null,null,null,null,null,null,null,null,null,null,null,null,null,null,null,null,null,null,null,null,null,null,null,null,null,null,null,99.243856332703203,64.508506616257094,120,69,null,64.508506616257094,null,111.6610908060283]
[null,null,null,null,null,null,null,null,null,null,null,null,null,null,null,null,null,null,null,null,null,null,null,null,null,null,null,null,null,null,null,null,null,null,null,null,null,null,null,null,null,null,null,null,null,null,null,null,null,null,null,null,null,null,null,null,null,null,null,null,98.676748582230601,64.139886578449904,160,69,null,64.139886578449904,null,148.88145440803774]
[null,null,null,null,null,null,null,null,null,null,null,null,null,null,null,null,null,null,null,null,null,null,null,null,null,null,null,null,null,null,null,null,null,null,null,null,null,null,null,null,null,null,null,null,null,null,null,null,null,null,null,null,null,null,null,null,null,null,null,null,86.379928315412201,56.146953405017904,0,69,null,56.146953405017904,null,0]
[null,null,null,null,null,null,null,null,null,null,null,null,null,null,null,null,null,null,null,null,null,null,null,null,null,null,null,null,null,null,null,null,null,null,null,null,null,null,null,null,null,null,null,null,null,null,null,null,null,null,null,null,null,null,null,null,null,null,null,null,96.057347670250905,62.437275985663099,60,69,null,62.437275985663099,null,55.830545403014149]
[null,null,null,null,null,null,null,null,null,null,null,null,null,null,null,null,null,null,null,null,null,null,null,null,null,null,null,null,null,null,null,null,null,null,null,null,null,null,null,null,null,null,null,null,null,null,null,null,null,null,null,null,null,null,null,null,null,null,null,null,0,0,0,0,null,999,null,0]
[null,null,null,null,null,null,null,null,null,null,null,null,null,null,null,null,null,null,null,null,null,null,null,null,null,null,null,null,null,null,null,null,null,null,null,null,null,null,null,null,null,null,null,null,null,null,null,null,null,null,null,null,null,null,null,null,null,null,null,null,0,0,0,0,null,999,null,0]
[null,null,null,null,null,null,null,null,null,null,null,null,null,null,null,null,null,null,null,null,null,null,null,null,null,null,null,null,null,null,null,null,null,null,null,null,null,null,null,null,null,null,null,null,null,null,null,null,null,null,null,null,null,null,null,null,null,null,null,null,0,0,0,0,null,999,null,0]
[null,null,null,null,null,null,null,null,null,null,null,null,null,null,null,null,null,null,null,null,null,null,null,null,null,null,null,null,null,null,null,null,null,null,null,null,null,null,null,null,null,null,null,null,null,null,null,null,null,null,null,null,null,null,null,null,null,null,null,null,0,0,0,0,null,999,null,0]
[null,null,null,null,null,null,null,null,null,null,null,null,null,null,null,null,null,null,null,null,null,null,null,null,null,null,null,null,null,null,null,null,null,null,null,null,null,null,null,null,null,null,null,null,null,null,null,null,null,null,null,null,null,null,null,null,null,null,null,null,0,0,0,0,null,999,null,0]
[null,null,null,null,null,null,null,null,null,null,null,null,null,null,null,null,null,null,null,null,null,null,null,null,null,null,null,null,null,null,null,null,null,null,null,null,null,null,null,null,null,null,null,null,null,null,null,null,null,null,null,null,null,null,null,null,null,null,null,null,0,0,0,0,null,999,null,0]
[null,null,null,null,null,null,null,null,null,null,null,null,null,null,null,null,null,null,null,null,null,null,null,null,null,null,null,null,null,null,null,null,null,null,null,null,null,null,null,null,null,null,null,null,null,null,null,null,null,null,null,null,null,null,null,null,null,null,null,null,0,0,0,0,null,999,null,0]
[null,null,null,null,null,null,null,null,null,null,null,null,null,null,null,null,null,null,null,null,null,null,null,null,null,null,null,null,null,null,null,null,null,null,null,null,null,null,null,null,null,null,null,null,null,null,null,null,null,null,null,null,null,null,null,null,null,null,null,null,0,0,0,0,null,999,null,0]
[null,null,null,null,null,null,null,null,null,null,null,null,null,null,null,null,null,null,null,null,null,null,null,null,null,null,null,null,null,null,null,null,null,null,null,null,null,null,null,null,null,null,null,null,null,null,null,null,null,null,null,null,null,null,null,null,null,null,null,null,0,0,0,0,null,999,null,0]
[null,null,null,null,null,null,null,null,null,null,null,null,null,null,null,null,null,null,null,null,null,null,null,null,null,null,null,null,null,null,null,null,null,null,null,null,null,null,null,null,null,null,null,null,null,null,null,null,null,null,null,null,null,null,null,null,null,null,null,null,0,0,0,0,null,999,null,0]
[null,null,null,null,null,null,null,null,null,null,null,null,null,null,null,null,null,null,null,null,null,null,null,null,null,null,null,null,null,null,null,null,null,null,null,null,null,null,null,null,null,null,null,null,null,null,null,null,null,null,null,null,null,null,null,null,null,null,null,null,0,0,0,0,null,999,null,0]
[null,null,null,null,null,null,null,null,null,null,null,null,null,null,null,null,null,null,null,null,null,null,null,null,null,null,null,null,null,null,null,null,null,null,null,null,null,null,null,null,null,null,null,null,null,null,null,null,null,null,null,null,null,null,null,null,null,null,null,null,0,0,0,0,null,999,null,0]
[null,null,null,null,null,null,null,null,null,null,null,null,null,null,null,null,null,null,null,null,null,null,null,null,null,null,null,null,null,null,null,null,null,null,null,null,null,null,null,null,null,null,null,null,null,null,null,null,null,null,null,null,null,null,null,null,null,null,null,null,0,0,0,0,null,999,null,0]
[null,null,null,null,null,null,null,null,null,null,null,null,null,null,null,null,null,null,null,null,null,null,null,null,null,null,null,null,null,null,null,null,null,null,null,null,null,null,null,null,null,null,null,null,null,null,null,null,null,null,null,null,null,null,null,null,null,null,null,null,87.605633802816897,56.943661971830998,120,65,null,56.943661971830998,null,111.6610908060283]
[null,null,null,null,null,null,null,null,null,null,null,null,null,null,null,null,null,null,null,null,null,null,null,null,null,null,null,null,null,null,null,null,null,null,null,null,null,null,null,null,null,null,null,null,null,null,null,null,null,null,null,null,null,null,null,null,null,null,null,null,{"$f":"_xlfn.NUMBERVALUE(IF(AND($G323>=($U$151-$Y$151),$G323<=($U$151+$Y$151)),B323,\"\"))","v":100},{"$f":"_xlfn.NUMBERVALUE(IFERROR(+BI496*$W$149,\"\"))","v":65},{"$f":"_xlfn.NUMBERVALUE(IF(AND($G323>=($U$151-$Y$151),$G323<=($U$151+$Y$151)),C323,\"\"))","v":180},{"$f":"_xlfn.NUMBERVALUE(IF(AND($G323>=($U$151-$Y$151),$G323<=($U$151+$Y$151)),G323,\"\"))","v":80},null,{"$f":"IF(BJ496=0,999,BJ496)","v":65},null,{"$f":"+BK496*$BP$172","v":167.49163620904244}]
[null,null,null,null,null,null,null,null,null,null,null,null,null,null,null,null,null,null,null,null,null,null,null,null,null,null,null,null,null,null,null,null,null,null,null,null,null,null,null,null,null,null,null,null,null,null,null,null,null,null,null,null,null,null,null,null,null,null,null,null,0,0,0,0,null,999,null,0]
[null,null,null,null,null,null,null,null,null,null,null,null,null,null,null,null,null,null,null,null,null,null,null,null,null,null,null,null,null,null,null,null,null,null,null,null,null,null,null,null,null,null,null,null,null,null,null,null,null,null,null,null,null,null,null,null,null,null,null,null,0,0,0,0,null,999,null,0]
[null,null,null,null,null,null,null,null,null,null,null,null,null,null,null,null,null,null,null,null,null,null,null,null,null,null,null,null,null,null,null,null,null,null,null,null,null,null,null,null,null,null,null,null,null,null,null,null,null,null,null,null,null,null,null,null,null,null,null,null,0,0,0,0,null,999,null,0]
[null,null,null,null,null,null,null,null,null,null,null,null,null,null,null,null,null,null,null,null,null,null,null,null,null,null,null,null,null,null,null,null,null,null,null,null,null,null,null,null,null,null,null,null,null,null,null,null,null,null,null,null,null,null,null,null,null,null,null,null,0,0,0,0,null,999,null,0]
[null,null,null,null,null,null,null,null,null,null,null,null,null,null,null,null,null,null,null,null,null,null,null,null,null,null,null,null,null,null,null,null,null,null,null,null,null,null,null,null,null,null,null,null,null,null,null,null,null,null,null,null,null,null,null,null,null,null,null,null,0,0,0,0,null,999,null,0]
[null,null,null,null,null,null,null,null,null,null,null,null,null,null,null,null,null,null,null,null,null,null,null,null,null,null,null,null,null,null,null,null,null,null,null,null,null,null,null,null,null,null,null,null,null,null,null,null,null,null,null,null,null,null,null,null,null,null,null,null,0,0,0,0,null,999,null,0]
[null,null,null,null,null,null,null,null,null,null,null,null,null,null,null,null,null,null,null,null,null,null,null,null,null,null,null,null,null,null,null,null,null,null,null,null,null,null,null,null,null,null,null,null,null,null,null,null,null,null,null,null,null,null,null,null,null,null,null,null,0,0,0,0,null,999,null,0]
[null,null,null,null,null,null,null,null,null,null,null,null,null,null,null,null,null,null,null,null,null,null,null,null,null,null,null,null,null,null,null,null,null,null,null,null,null,null,null,null,null,null,null,null,null,null,null,null,null,null,null,null,null,null,null,null,null,null,null,null,0,0,0,0,null,999,null,0]
[null,null,null,null,null,null,null,null,null,null,null,null,null,null,null,null,null,null,null,null,null,null,null,null,null,null,null,null,null,null,null,null,null,null,null,null,null,null,null,null,null,null,null,null,null,null,null,null,null,null,null,null,null,null,null,null,null,null,null,null,0,0,0,0,null,999,null,0]
[null,null,null,null,null,null,null,null,null,null,null,null,null,null,null,null,null,null,null,null,null,null,null,null,null,null,null,null,null,null,null,null,null,null,null,null,null,null,null,null,null,null,null,null,null,null,null,null,null,null,null,null,null,null,null,null,null,null,null,null,0,0,0,0,null,999,null,0]
[null,null,null,null,null,null,null,null,null,null,null,null,null,null,null,null,null,null,null,null,null,null,null,null,null,null,null,null,null,null,null,null,null,null,null,null,null,null,null,null,null,null,null,null,null,null,null,null,null,null,null,null,null,null,null,null,null,null,null,null,0,0,0,0,null,999,null,0]
[null,null,null,null,null,null,null,null,null,null,null,null,null,null,null,null,null,null,null,null,null,null,null,null,null,null,null,null,null,null,null,null,null,null,null,null,null,null,null,null,null,null,null,null,null,null,null,null,null,null,null,null,null,null,null,null,null,null,null,null,0,0,0,0,null,999,null,0]
[null,null,null,null,null,null,null,null,null,null,null,null,null,null,null,null,null,null,null,null,null,null,null,null,null,null,null,null,null,null,null,null,null,null,null,null,null,null,null,null,null,null,null,null,null,null,null,null,null,null,null,null,null,null,null,null,null,null,null,null,0,0,0,0,null,999,null,0]
[null,null,null,null,null,null,null,null,null,null,null,null,null,null,null,null,null,null,null,null,null,null,null,null,null,null,null,null,null,null,null,null,null,null,null,null,null,null,null,null,null,null,null,null,null,null,null,null,null,null,null,null,null,null,null,null,null,null,null,null,0,0,0,0,null,999,null,0]
[null,null,null,null,null,null,null,null,null,null,null,null,null,null,null,null,null,null,null,null,null,null,null,null,null,null,null,null,null,null,null,null,null,null,null,null,null,null,null,null,null,null,null,null,null,null,null,null,null,null,null,null,null,null,null,null,null,null,null,null,85.227272727272705,55.397727272727302,60,77,null,55.397727272727302,null,55.830545403014149]
[null,null,null,null,null,null,null,null,null,null,null,null,null,null,null,null,null,null,null,null,null,null,null,null,null,null,null,null,null,null,null,null,null,null,null,null,null,null,null,null,null,null,null,null,null,null,null,null,null,null,null,null,null,null,null,null,null,null,null,null,88.210227272727295,57.336647727272698,120,77,null,57.336647727272698,null,111.6610908060283]
[null,null,null,null,null,null,null,null,null,null,null,null,null,null,null,null,null,null,null,null,null,null,null,null,null,null,null,null,null,null,null,null,null,null,null,null,null,null,null,null,null,null,null,null,null,null,null,null,null,null,null,null,null,null,null,null,null,null,null,null,100,65,180,87,null,65,null,167.49163620904244]
[null,null,null,null,null,null,null,null,null,null,null,null,null,null,null,null,null,null,null,null,null,null,null,null,null,null,null,null,null,null,null,null,null,null,null,null,null,null,null,null,null,null,null,null,null,null,null,null,null,null,null,null,null,null,null,null,null,null,null,null,0,0,0,0,null,999,null,0]
[null,null,null,null,null,null,null,null,null,null,null,null,null,null,null,null,null,null,null,null,null,null,null,null,null,null,null,null,null,null,null,null,null,null,null,null,null,null,null,null,null,null,null,null,null,null,null,null,null,null,null,null,null,null,null,null,null,null,null,null,0,0,0,0,null,999,null,0]
[null,null,null,null,null,null,null,null,null,null,null,null,null,null,null,null,null,null,null,null,null,null,null,null,null,null,null,null,null,null,null,null,null,null,null,null,null,null,null,null,null,null,null,null,null,null,null,null,null,null,null,null,null,null,null,null,null,null,null,null,0,0,0,0,null,999,null,0]
[null,null,null,null,null,null,null,null,null,null,null,null,null,null,null,null,null,null,null,null,null,null,null,null,null,null,null,null,null,null,null,null,null,null,null,null,null,null,null,null,null,null,null,null,null,null,null,null,null,null,null,null,null,null,null,null,null,null,null,null,0,0,0,0,null,999,null,0]
[null,null,null,null,null,null,null,null,null,null,null,null,null,null,null,null,null,null,null,null,null,null,null,null,null,null,null,null,null,null,null,null,null,null,null,null,null,null,null,null,null,null,null,null,null,null,null,null,null,null,null,null,null,null,null,null,null,null,null,null,0,0,0,0,null,999,null,0]
[null,null,null,null,null,null,null,null,null,null,null,null,null,null,null,null,null,null,null,null,null,null,null,null,null,null,null,null,null,null,null,null,null,null,null,null,null,null,null,null,null,null,null,null,null,null,null,null,null,null,null,null,null,null,null,null,null,null,null,null,0,0,0,0,null,999,null,0]
[null,null,null,null,null,null,null,null,null,null,null,null,null,null,null,null,null,null,null,null,null,null,null,null,null,null,null,null,null,null,null,null,null,null,null,null,null,null,null,null,null,null,null,null,null,null,null,null,null,null,null,null,null,null,null,null,null,null,null,null,100,65,120,63,null,65,null,111.6610908060283]
[null,null,null,null,null,null,null,null,null,null,null,null,null,null,null,null,null,null,null,null,null,null,null,null,null,null,null,null,null,null,null,null,null,null,null,null,null,null,null,null,null,null,null,null,null,null,null,null,null,null,null,null,null,null,null,null,null,null,null,null,81.699346405228795,53.1045751633987,0,63,null,53.1045751633987,null,0]
[null,null,null,null,null,null,null,null,null,null,null,null,null,null,null,null,null,null,null,null,null,null,null,null,null,null,null,null,null,null,null,null,null,null,null,null,null,null,null,null,null,null,null,null,null,null,null,null,null,null,null,null,null,null,null,null,null,null,null,null,85.403050108932504,55.511982570806097,40,63,null,55.511982570806097,null,37.220363602009435]
[null,null,null,null,null,null,null,null,null,null,null,null,null,null,null,null,null,null,null,null,null,null,null,null,null,null,null,null,null,null,null,null,null,null,null,null,null,null,null,null,null,null,null,null,null,null,null,null,null,null,null,null,null,null,null,null,null,null,null,null,93.246187363834395,60.610021786492403,80,63,null,60.610021786492403,null,74.44072720401887]
[null,null,null,null,null,null,null,null,null,null,null,null,null,null,null,null,null,null,null,null,null,null,null,null,null,null,null,null,null,null,null,null,null,null,null,null,null,null,null,null,null,null,null,null,null,null,null,null,null,null,null,null,null,null,null,null,null,null,null,null,0,0,0,0,null,999,null,0]
[null,null,null,null,null,null,null,null,null,null,null,null,null,null,null,null,null,null,null,null,null,null,null,null,null,null,null,null,null,null,null,null,null,null,null,null,null,null,null,null,null,null,null,null,null,null,null,null,null,null,null,null,null,null,null,null,null,null,null,null,0,0,0,0,null,999,null,0]
[null,null,null,null,null,null,null,null,null,null,null,null,null,null,null,null,null,null,null,null,null,null,null,null,null,null,null,null,null,null,null,null,null,null,null,null,null,null,null,null,null,null,null,null,null,null,null,null,null,null,null,null,null,null,null,null,null,null,null,null,0,0,0,0,null,999,null,0]
[null,null,null,null,null,null,null,null,null,null,null,null,null,null,null,null,null,null,null,null,null,null,null,null,null,null,null,null,null,null,null,null,null,null,null,null,null,null,null,null,null,null,null,null,null,null,null,null,null,null,null,null,null,null,null,null,null,null,null,null,0,0,0,0,null,999,null,0]
[null,null,null,null,null,null,null,null,null,null,null,null,null,null,null,null,null,null,null,null,null,null,null,null,null,null,null,null,null,null,null,null,null,null,null,null,null,null,null,null,null,null,null,null,null,null,null,null,null,null,null,null,null,null,null,null,null,null,null,null,0,0,0,0,null,999,null,0]
[null,null,null,null,null,null,null,null,null,null,null,null,null,null,null,null,null,null,null,null,null,null,null,null,null,null,null,null,null,null,null,null,null,null,null,null,null,null,null,null,null,null,null,null,null,null,null,null,null,null,null,null,null,null,null,null,null,null,null,null,0,0,0,0,null,999,null,0]
[null,null,null,null,null,null,null,null,null,null,null,null,null,null,null,null,null,null,null,null,null,null,null,null,null,null,null,null,null,null,null,null,null,null,null,null,null,null,null,null,null,null,null,null,null,null,null,null,null,null,null,null,null,null,null,null,null,null,null,null,0,0,0,0,null,999,null,0]
[null,null,null,null,null,null,null,null,null,null,null,null,null,null,null,null,null,null,null,null,null,null,null,null,null,null,null,null,null,null,null,null,null,null,null,null,null,null,null,null,null,null,null,null,null,null,null,null,null,null,null,null,null,null,null,null,null,null,null,null,0,0,0,0,null,999,null,0]
[null,null,null,null,null,null,null,null,null,null,null,null,null,null,null,null,null,null,null,null,null,null,null,null,null,null,null,null,null,null,null,null,null,null,null,null,null,null,null,null,null,null,null,null,null,null,null,null,null,null,null,null,null,null,null,null,null,null,null,null,98.796791443850296,64.217914438502703,120,69,null,64.217914438502703,null,111.6610908060283]
[null,null,null,null,null,null,null,null,null,null,null,null,null,null,null,null,null,null,null,null,null,null,null,null,null,null,null,null,null,null,null,null,null,null,null,null,null,null,null,null,null,null,null,null,null,null,null,null,null,null,null,null,null,null,null,null,null,null,null,null,100,65,180,69,null,65,null,167.49163620904244]
[null,null,null,null,null,null,null,null,null,null,null,null,null,null,null,null,null,null,null,null,null,null,null,null,null,null,null,null,null,null,null,null,null,null,null,null,null,null,null,null,null,null,null,null,null,null,null,null,null,null,null,null,null,null,null,null,null,null,null,null,67.887931034482804,44.127155172413801,0,69,null,44.127155172413801,null,0]
[null,null,null,null,null,null,null,null,null,null,null,null,null,null,null,null,null,null,null,null,null,null,null,null,null,null,null,null,null,null,null,null,null,null,null,null,null,null,null,null,null,null,null,null,null,null,null,null,null,null,null,null,null,null,null,null,null,null,null,null,84.698275862068996,55.053879310344797,40,69,null,55.053879310344797,null,37.220363602009435]
[null,null,null,null,null,null,null,null,null,null,null,null,null,null,null,null,null,null,null,null,null,null,null,null,null,null,null,null,null,null,null,null,null,null,null,null,null,null,null,null,null,null,null,null,null,null,null,null,null,null,null,null,null,null,null,null,null,null,null,null,92.995689655172399,60.4471982758621,80,66,null,60.4471982758621,null,74.44072720401887]
[null,null,null,null,null,null,null,null,null,null,null,null,null,null,null,null,null,null,null,null,null,null,null,null,null,null,null,null,null,null,null,null,null,null,null,null,null,null,null,null,null,null,null,null,null,null,null,null,null,null,null,null,null,null,null,null,null,null,null,null,100,65,120,66,null,65,null,111.6610908060283]
[null,null,null,null,null,null,null,null,null,null,null,null,null,null,null,null,null,null,null,null,null,null,null,null,null,null,null,null,null,null,null,null,null,null,null,null,null,null,null,null,null,null,null,null,null,null,null,null,null,null,null,null,null,null,null,null,null,null,null,null,98.383620689655203,63.9493534482759,160,66,null,63.9493534482759,null,148.88145440803774]
[null,null,null,null,null,null,null,null,null,null,null,null,null,null,null,null,null,null,null,null,null,null,null,null,null,null,null,null,null,null,null,null,null,null,null,null,null,null,null,null,null,null,null,null,null,null,null,null,null,null,null,null,null,null,null,null,null,null,null,null,60.759493670886101,39.493670886076004,0,66,null,39.493670886076004,null,0]
[null,null,null,null,null,null,null,null,null,null,null,null,null,null,null,null,null,null,null,null,null,null,null,null,null,null,null,null,null,null,null,null,null,null,null,null,null,null,null,null,null,null,null,null,null,null,null,null,null,null,null,null,null,null,null,null,null,null,null,null,0,0,0,0,null,999,null,0]
[null,null,null,null,null,null,null,null,null,null,null,null,null,null,null,null,null,null,null,null,null,null,null,null,null,null,null,null,null,null,null,null,null,null,null,null,null,null,null,null,null,null,null,null,null,null,null,null,null,null,null,null,null,null,null,null,null,null,null,null,94.303797468354404,61.2974683544304,80,65,null,61.2974683544304,null,74.44072720401887]
[null,null,null,null,null,null,null,null,null,null,null,null,null,null,null,null,null,null,null,null,null,null,null,null,null,null,null,null,null,null,null,null,null,null,null,null,null,null,null,null,null,null,null,null,null,null,null,null,null,null,null,null,null,null,null,null,null,null,null,null,96.455696202531698,62.696202531645604,120,74,null,62.696202531645604,null,111.6610908060283]
[null,null,null,null,null,null,null,null,null,null,null,null,null,null,null,null,null,null,null,null,null,null,null,null,null,null,null,null,null,null,null,null,null,null,null,null,null,null,null,null,null,null,null,null,null,null,null,null,null,null,null,null,null,null,null,null,null,null,null,null,100,65,160,85,null,65,null,148.88145440803774]
[null,null,null,null,null,null,null,null,null,null,null,null,null,null,null,null,null,null,null,null,null,null,null,null,null,null,null,null,null,null,null,null,null,null,null,null,null,null,null,null,null,null,null,null,null,null,null,null,null,null,null,null,null,null,null,null,null,null,null,null,0,0,0,0,null,999,null,0]
[null,null,null,null,null,null,null,null,null,null,null,null,null,null,null,null,null,null,null,null,null,null,null,null,null,null,null,null,null,null,null,null,null,null,null,null,null,null,null,null,null,null,null,null,null,null,null,null,null,null,null,null,null,null,null,null,null,null,null,null,0,0,0,0,null,999,null,0]
[null,null,null,null,null,null,null,null,null,null,null,null,null,null,null,null,null,null,null,null,null,null,null,null,null,null,null,null,null,null,null,null,null,null,null,null,null,null,null,null,null,null,null,null,null,null,null,null,null,null,null,null,null,null,null,null,null,null,null,null,97.192642787996107,63.175217812197502,80,60,null,63.175217812197502,null,74.44072720401887]
[null,null,null,null,null,null,null,null,null,null,null,null,null,null,null,null,null,null,null,null,null,null,null,null,null,null,null,null,null,null,null,null,null,null,null,null,null,null,null,null,null,null,null,null,null,null,null,null,null,null,null,null,null,null,null,null,null,null,null,null,99.515972894482104,64.685382381413405,120,71,null,64.685382381413405,null,111.6610908060283]
[null,null,null,null,null,null,null,null,null,null,null,null,null,null,null,null,null,null,null,null,null,null,null,null,null,null,null,null,null,null,null,null,null,null,null,null,null,null,null,null,null,null,null,null,null,null,null,null,null,null,null,null,null,null,null,null,null,null,null,null,98.354307841239105,63.930300096805396,160,81,null,63.930300096805396,null,148.88145440803774]

{"sheet":"K on Rice","index":2,"n_rows":588,"n_cols":78,"rows_kept":588,"cut":false,"hidden":false,"merged":[[142,16,142,24],[183,16,183,24],[186,17,187,18]]}
[null,"RELYLD","KRATE","YEAR","SITE","YEAROB","KSOIL","DCLAY"]
[1,97.1,0,2004,1,1,104,0,null,null,null,null,null,null,null,null,"Rice Price",null,null,null,10,"$/cwt",null,null,"Conventional"]
[2,100,40,2004,1,15,104,0,null,"Dependent Variable: RELYLD",null,null,null,null,null,null,null,null,null,null,null,null,null,null,"Clearfield"]
[3,99.5,80,2004,1,37,104,0,null,"Method: Panel EGLS (Period random effects)",null,null,null,null,null,null,"Cost of K (0-0-60)",null,null,null,450,"$/ton"]
[4,99.5,120,2004,1,57,104,0,null,"Date: 03/12/19   Time: 15:57",null,null,null,null,null,null,null,null,null,null,null,null,null,null,"Clay"]
[5,98.6,160,2004,1,71,104,0,null,"Sample: 2001 2018 IF KRATE<>135",null,null,null,null,null,null,"How much K do you currently apply per acre?",null,null,null,25,"lbs/acre",null,null,"Loam"]
[6,88.8,0,2004,2,2,74,0,null,"Periods included: 17"]
[7,90.8,40,2004,2,16,74,0,null,"Cross-sections included: 79",null,null,null,null,null,null,"What yield do you expect at that application rate?",null,null,null,180,"bu/acre",null,null,"Yes"]
[8,96.1,80,2004,2,38,74,0,null,"Total panel (unbalanced) observations: 440",null,null,null,null,null,null,null,null,null,null,null,null,null,null,"No"]
[9,99,120,2004,2,58,74,0,null,"Wallace and Hussain estimator of component variances",null,null,null,null,null,null,"Do you use conventional or hybrid seed?",null,null,null,"Conventional"]
[10,100,160,2004,2,72,74,0]
[11,92.5,0,2004,3,3,87,0,null,"Variable","Coefficient","Std. Error","t-Statistic","Prob.  ",null,null,"What is your soil test K?",null,null,null,110]
[12,95.3,40,2004,3,17,87,0]
[13,96.7,80,2004,3,39,87,0,null,"C",85.531903931343507,1.0887681974460901,78.5584150345084,1.52334084563578E-257,null,null,"Does the field have mostly clayey or loamy soil texture?",null,null,null,"Loam"]
[14,98.1,120,2004,3,59,87,0,null,"DRREC",1.8218734362598099,0.61695284893863001,2.9530189209662501,3.3189332097646098E-3]
[15,100,160,2004,3,73,87,0,null,"KRATE",0.15462761258478799,1.68022741166984E-2,9.2027788328436202,1.51928926815474E-18,null,null,"Do you operate South of I-40?",null,null,null,"No"]
[16,91.5,0,2004,4,4,64,0,null,"KRATE^2",-4.2195811300604799E-4,8.7108479998345494E-5,-4.8440532197790898,1.77718926043751E-6]
[17,85.7,40,2004,4,18,64,0,null,"DCLFIELD",2.25413928281827,0.92655603374247097,2.4328148549349198,1.5387838751224099E-2,null,null,"Predicted RELYLD based on above questions:",null,null,null,{"$f":"+K14+IF($U$16=\"Yes\",K15,0)+$U$6*($U$12*K21+K16+IF($U$10=\"Clearfield\",K23,0))+$U$6^2*(K17+IF($U$14=\"Clay\",K22))+IF($U$14=\"Clay\",K20,0)+IF($U$10=\"Clearfield\",K18,0)+$U$12*K19","v":93.328781846137147}]
[18,89.7,80,2004,4,40,64,0,null,"KSOIL",4.8135418919568303E-2,9.6227532755463804E-3,5.0022501399772299,8.2652555394556796E-7]
[19,100,120,2004,4,60,64,0,null,"DCLAY",-3.2678032569792799,1.6364469951037599,-1.99688915483148,4.6465607051286599E-2,null,null,"Yield/RELYLD",null,null,null,{"$f":"+U8/U18","v":1.9286654817454918}]
[20,82.5,160,2004,4,74,64,0,null,"KSOIL*KRATE",-3.9999442194537998E-4,8.7972098694473307E-5,-4.5468327785899403,7.0861123117113604E-6]
[21,96.6,0,2004,5,5,76,0,null,"DCLAY*KRATE^2",null,null,null,null,null,null,"dRELYLD/dKRATE",null,null,null,{"$f":"+K16+U12*K21+IF(U10=\"Clearfield\",K23,0)+2*U6*(K17+IF(U14=\"Clay\",K22))","v":8.9530320520493797E-2},null,{"$f":"+K16+U12*K21+IF(U10=\"Clearfield\",K23,0)+2*U28*(K17+IF(U14=\"Clay\",K22))","v":4.3164561603838428E-2}]
[22,94.1,40,2004,5,19,76,0,null,"DCLFIELD*KRATE",-2.08785687496169E-2,9.5664735416848001E-3,-2.1824728473497501,2.96137948544343E-2]
[23,100,80,2004,5,41,76,0,null,null,null,null,null,null,null,null,{"$f":"CONCATENATE(\"VMP of K @ KRATE =  \",U6,\" lbs/acre and soil test K of \",U12)","v":"VMP of K @ KRATE =  25 lbs/acre and soil test K of 110"},null,null,null,{"$f":"+U22*U2/2.22*U20","v":0.77781098539408311},null,{"$f":"+W22*U2/2.22*U20","v":0.37499999999999994}]
[24,97.5,120,2004,5,61,76,0,null,null,"Effects Specification"]
[25,98.5,160,2004,5,75,76,0,null,null,null,null,"S.D.  ","Rho  ",null,null,"Cost per lb of K",null,null,null,{"$f":"+U4/0.6/2000","v":0.375}]
[26,102.7,0,2004,6,6,132,0]
[27,98.2,40,2004,6,20,132,0,null,"Period random",null,null,1.0600971748826,4.7688267843004797E-2,null,null,"Profit Maximizing K rate:",null,null,null,{"$f":"IF((U26/(U2/2.22*U20)-(K16+U12*K21+IF(U10=\"Clearfield\",K23,0)))/(2*(K17+IF(U14=\"Clay\",K22)))>180,180,(U26/(U2/2.22*U20)-(K16+U12*K21+IF(U10=\"Clearfield\",K23,0)))/(2*(K17+IF(U14=\"Clay\",K22))))","v":79.941186681236772},null,125,"Alt User K"]
[28,99.5,80,2004,6,42,132,0,null,"Idiosyncratic random",null,null,4.7372845346977401,0.95231173215699505]
[29,100,120,2004,6,62,132,0,null,null,null,null,null,null,null,null,"Expected Yield at Profit-Maximizing K rate:",null,null,null,{"$f":"(+K14+IF(U16=\"Yes\",K15,0)+U28*(U12*K21+K16+IF(U10=\"Clearfield\",K23,0))+U28^2*(K17+IF(U14=\"Clay\",K22))+IF(U14=\"Clay\",K20,0)+IF(U10=\"Clearfield\",K18,0)+U12*K19)*U20","v":187.03038519479557},null,{"$f":"(+K14+IF(U16=\"Yes\",K15,0)+W28*(U12*K21+K16+IF(U10=\"Clearfield\",K23,0))+W28^2*(K17+IF(U14=\"Clay\",K22))+IF(U14=\"Clay\",K20,0)+IF(U10=\"Clearfield\",K18,0)+U12*K19)*U20","v":189.12924340277638}]
[30,98.6,160,2004,6,76,132,0,null,null,"Weighted Statistics"]
[31,83.4,0,2004,7,7,81,0,null,null,null,null,null,null,null,null,"Added Profit in $/acre",null,null,null,{"$f":"+(U30-U8)*U2/2.22-(U28-U6)*U26","v":11.065456772894635},null,{"$f":"+(W30-U8)*U2/2.22-(W28-U6)*U26","v":3.6227180305242399}]
[32,89.4,30,2004,7,13,81,0,null,"R-squared",0.29544205258799699,"    Mean dependent var",null,60.432687873492299]
[33,95.4,60,2004,7,27,87,0,null,"Adjusted R-squared",0.28236441087269298,"    S.D. dependent var",null,9.8841223268864802,null,null,null,null,null,null,null,null,null,null,null,null,null,null,null,null,null,null,null,null,null,null,null,null,null,null,null,null,null,null,null,null,null,null,null,null,null,null,null,null,null,null,null,null,null,"K rate","Exp. Yield"]
[34,89.4,90,2004,7,45,100,0,null,"S.E. of regression",4.7439141955850399,"    Sum squared resid",null,9699.5351367765797,null,null,null,null,null,null,null,null,null,null,null,null,null,null,null,null,null,null,null,null,null,null,null,null,null,null,null,null,null,null,null,null,null,null,null,null,null,null,null,null,null,null,null,null,null,0,{"$f":"(+$K$14+IF($U$16=\"Yes\",$K$15,0)+BH35*($U$12*$K$21+$K$16+IF($U$10=\"Clearfield\",$K$23,0))+BH35^2*($K$17+IF($U$14=\"Clay\",$K$22))+IF($U$14=\"Clay\",$K$20,0)+IF($U$10=\"Clearfield\",$K$18,0)+$U$12*$K$19)*$U$20","v":175.17451400150208}]
[35,100,120,2004,7,63,105,0,null,"F-statistic",22.591386048010399,"    Durbin-Watson stat",null,2.4906446401097999,null,null,null,null,null,null,null,null,null,null,null,null,null,null,null,null,null,null,null,null,null,null,null,null,null,null,null,null,null,null,null,null,null,null,null,null,null,null,null,null,null,null,null,null,null,10,{"$f":"(+$K$14+IF($U$16=\"Yes\",$K$15,0)+BH36*($U$12*$K$21+$K$16+IF($U$10=\"Clearfield\",$K$23,0))+BH36^2*($K$17+IF($U$14=\"Clay\",$K$22))+IF($U$14=\"Clay\",$K$20,0)+IF($U$10=\"Clearfield\",$K$18,0)+$U$12*$K$19)*$U$20","v":177.22678080799585}]
[36,89.4,0,2004,8,8,78,0,null,"Prob(F-statistic)",7.6933271621005695E-29,null,null,null,null,null,null,null,null,null,null,null,null,null,null,null,null,null,null,null,null,null,null,null,null,null,null,null,null,null,null,null,null,null,null,null,null,null,null,null,null,null,null,null,null,null,null,null,null,20,179.11628440503014]
[37,94.7,30,2004,8,14,83,0,null,null,null,null,null,null,null,null,null,null,null,null,null,null,null,null,null,null,null,null,null,null,null,null,null,null,null,null,null,null,null,null,null,null,null,null,null,null,null,null,null,null,null,null,null,null,null,null,null,null,null,30,180.84302479260501]
[38,95.3,60,2004,8,28,87,0,null,null,"Unweighted Statistics",null,null,null,null,null,null,null,null,null,null,null,null,null,null,null,null,null,null,null,null,null,null,null,null,null,null,null,null,null,null,null,null,null,null,null,null,null,null,null,null,null,null,null,null,null,null,null,null,40,182.40700197072042]
[39,100,90,2004,8,46,112,0,null,null,null,null,null,null,null,null,null,null,null,null,null,null,null,null,null,null,null,null,null,null,null,null,null,null,null,null,null,null,null,null,null,null,null,null,null,null,null,null,null,null,null,null,null,null,null,null,null,null,null,50,183.80821593937642]
[40,100,120,2004,8,64,115,0,null,"R-squared",0.29611730962803401,"    Mean dependent var",null,95.920454545454504,null,null,null,null,null,null,null,null,null,null,null,null,null,null,null,null,null,null,null,null,null,null,null,null,null,null,null,null,null,null,null,null,null,null,null,null,null,null,null,null,null,null,null,null,null,60,185.04666669857292]
[41,75.599999999999994,0,2005,9,1,94,0,null,"Sum squared resid",10114.186042011301,"    Durbin-Watson stat",null,2.48242050670396,null,null,null,null,null,null,null,null,null,null,null,null,null,null,null,null,null,null,null,null,null,null,null,null,null,null,null,null,null,null,null,null,null,null,null,null,null,null,null,null,null,null,null,null,null,70,186.12235424831002]
[42,90.3,40,2005,9,15,94,0,null,null,null,null,null,null,null,null,null,null,null,null,null,null,null,null,null,null,null,null,null,null,null,null,null,null,null,null,null,null,null,null,null,null,null,null,null,null,null,null,null,null,null,null,null,null,null,null,null,null,null,80,187.03527858858763]
[43,90.9,80,2005,9,37,94,0,null,null,null,null,null,null,null,null,null,null,null,null,null,null,null,null,null,null,null,null,null,null,null,null,null,null,null,null,null,null,null,null,null,null,null,null,null,null,null,null,null,null,null,null,null,null,null,null,null,null,null,90,187.78543971940584]
[44,92.6,120,2005,9,57,94,0,null,null,null,null,null,null,null,null,null,null,null,null,null,null,null,null,null,null,null,null,null,null,null,null,null,null,null,null,null,null,null,null,null,null,null,null,null,null,null,null,null,null,null,null,null,null,null,null,null,null,null,100,188.3728376407646]
[45,100,160,2005,9,71,94,0,null,null,null,null,null,null,null,null,null,null,null,null,null,null,null,null,null,null,null,null,null,null,null,null,null,null,null,null,null,null,null,null,null,null,null,null,null,null,null,null,null,null,null,null,null,null,null,null,null,null,null,110,188.7974723526639]
[46,91.3,0,2005,10,2,71,0,null,null,null,null,{"$f":"174/192","v":0.90625},null,null,null,null,null,null,null,null,null,null,null,null,null,null,null,null,null,null,null,null,null,null,null,null,null,null,null,null,null,null,null,null,null,null,null,null,null,null,null,null,null,null,null,null,null,null,120,189.05934385510372]
[47,100,40,2005,10,16,71,0,null,null,null,null,null,null,null,null,null,null,null,null,null,null,null,null,null,null,null,null,null,null,null,null,null,null,null,null,null,null,null,null,null,null,null,null,null,null,null,null,null,null,null,null,null,null,null,null,null,null,null,130,189.15845214808414]
[48,99.5,80,2005,10,38,71,0,null,null,null,null,null,null,null,null,null,null,null,null,null,null,null,null,null,null,null,null,null,null,null,null,null,null,null,null,null,null,null,null,null,null,null,null,null,null,null,null,null,null,null,null,null,null,null,null,null,null,null,140,189.09479723160507]
[49,99.5,120,2005,10,58,71,0,null,null,null,null,null,null,null,null,null,null,null,null,null,null,null,null,null,null,null,null,null,null,null,null,null,null,null,null,null,null,null,null,null,null,null,null,null,null,null,null,null,null,null,null,null,null,null,null,null,null,null,150,188.86837910566663]
[50,93.4,160,2005,10,72,71,0,null,null,null,null,null,null,null,null,null,null,null,null,null,null,null,null,null,null,null,null,null,null,null,null,null,null,null,null,null,null,null,null,null,null,null,null,null,null,null,null,null,null,null,null,null,null,null,null,null,null,null,160,188.47919777026871]
[51,86.6,0,2005,11,3,81,0,null,null,null,null,null,null,null,null,null,null,null,null,null,null,null,null,null,null,null,null,null,null,null,null,null,null,null,null,null,null,null,null,null,null,null,null,null,null,null,null,null,null,null,null,null,null,null,null,null,null,null,170,187.92725322541133]
[52,96.8,40,2005,11,17,81,0,null,null,null,null,null,null,null,null,null,null,null,null,null,null,null,null,null,null,null,null,null,null,null,null,null,null,null,null,null,null,null,null,null,null,null,null,null,null,null,null,null,null,null,null,null,null,null,null,null,null,null,180,187.2125454710945]
[53,100,80,2005,11,39,81,0]
[54,95.5,120,2005,11,59,81,0]
[55,96.8,160,2005,11,73,81,0]
[56,93.6,0,2005,12,4,94,0]
[57,95.5,40,2005,12,18,94,0,null,"Dependent Variable: RELYLD",null,null,null,null,null,null,"Predicted RELYLD based on above questions:",null,null,null,{"$f":"+K69+IF($U$16=\"Yes\",K70,0)+$U$6*($U$12*K76+K71+IF($U$10=\"Clearfield\",K77,0)+IF($U$14=\"Clay\",K78))+$U$6^0.5*K72+IF($U$14=\"Clay\",K75,0)+IF($U$10=\"Clearfield\",K73,0)+$U$12*K74","v":94.566945198811538}]
[58,97,80,2005,12,40,94,0,null,"Method: Panel EGLS (Period random effects)"]
[59,100,120,2005,12,60,94,0,null,"Date: 03/13/19   Time: 09:12",null,null,null,null,null,null,"Yield/RELYLD",null,null,null,{"$f":"+U8/U58","v":1.9034134984648117}]
[60,97.5,160,2005,12,74,94,0,null,"Sample: 2001 2018 IF KRATE<>135"]
[61,67.7,0,2005,13,5,64,0,null,"Periods included: 17",null,null,null,null,null,null,"dRELYLD/dKRATE",null,null,null,{"$f":"+K71+U12*K76+IF(U10=\"Clearfield\",K77,0)+IF(U14=\"Clay\",K78,0)+0.5*U6^-0.5*K72","v":5.9615107453487554E-2},null,{"$f":"+K71+U12*K76+IF(U10=\"Clearfield\",K77,0)+IF(U14=\"Clay\",K78,0)+0.5*U68^-0.5*K72","v":4.3737212154450339E-2}]
[62,94.9,40,2005,13,19,64,0,null,"Cross-sections included: 79"]
[63,96.2,80,2005,13,41,64,0,null,"Total panel (unbalanced) observations: 440",null,null,null,null,null,null,{"$f":"CONCATENATE(\"VMP of K @ KRATE =  \",U6,\" lbs/acre and soil test K of \",U12)","v":"VMP of K @ KRATE =  25 lbs/acre and soil test K of 110"},null,null,null,{"$f":"+U62*U2/2.22*U60","v":0.51113603711440714},null,{"$f":"+W62*U2/2.22*U60","v":0.37499999999999994}]
[64,100,120,2005,13,61,64,0,null,"Wallace and Hussain estimator of component variances"]
[65,99.4,160,2005,13,75,64,0,null,null,null,null,null,null,null,null,"Cost per lb of K",null,null,null,{"$f":"+U4/0.6/2000","v":0.375},null,{"$f":"(K71+U12*K76+IF(U10=\"Clearfield\",K77,0)+IF(U14=\"Clay\",K78)+0.5*W68^-0.5*K72)*U2/2.22*U60","v":1.3839809839067578},"VMP at Alt User K"]
[66,92.7,0,2005,14,6,164,0,null,"Variable","Coefficient","Std. Error","t-Statistic","Prob.  "]
[67,100,80,2005,14,42,164,0,null,null,null,null,null,null,null,null,"Optimal K",null,null,null,{"$f":"IF(((U66/(U2/2.22*U60)-(K71+U12*K76+IF(U10=\"Clearfield\",K77,0)+IF(U14=\"Clay\",K78,0)))*2/K72)^-2>180,180,((U66/(U2/2.22*U60)-(K71+U12*K76+IF(U10=\"Clearfield\",K77,0)+IF(U14=\"Clay\",K78,0)))*2/K72)^-2)","v":38.367544561875619},null,5,"Alt User K"]
[68,90.1,120,2005,14,62,164,0,null,"C",83.578024194847401,1.20659577850463,69.267625234383004,2.2750956979676501E-235]
[69,95.4,160,2005,14,76,164,0,null,"DRREC",1.90137269172526,0.611207364620451,3.1108471556228299,1.9897376464522699E-3,null,null,"Expected Yield",null,null,null,{"$f":"(+K69+IF(U16=\"Yes\",K70,0)+U68*(K71+IF(U10=\"Clearfield\",K77,0)+IF(U14=\"Clay\",K78,0)+U12*K76)+U68^0.5*(K72)+IF(U14=\"Clay\",K75,0)+IF(U10=\"Clearfield\",K73,0)+U12*K74)*U60","v":181.29329790088903},null,{"$f":"(K69+IF($U$16=\"Yes\",K70,0)+$W$68*($U$12*K76+K71+IF($U$10=\"Clearfield\",K77,0)+IF($U$14=\"Clay\",K78,0))+$W$68^0.5*K72+IF($U$14=\"Clay\",K75,0)+IF($U$10=\"Clearfield\",K73,0)+$U$12*K74)*U60","v":176.53298178147375}]
[70,74.400000000000006,0,2005,15,7,63,0,null,"KRATE",5.52742460889597E-2,1.9451119658015902E-2,2.8416999669312499,4.7008195051331499E-3]
[71,85.6,30,2005,15,13,68,0,null,"KRATE^.5",0.82359665888312805,0.17954385041366799,4.5871616153132599,5.9022854645111403E-6,null,null,"Added Profit in $/acre",null,null,null,{"$f":"+(U70-U8)*U2/2.22-(U68-U6)*U66","v":0.81283700951749793},null,{"$f":"+(W70-U8)*U2/2.22-(W68-U6)*U66","v":-8.1171991825506691}]
[72,92.2,60,2005,15,27,72,0,null,"DCLFIELD",2.3332614357395598,0.91706877676773202,2.5442600324517501,1.1299725801368E-2]
[73,95,90,2005,15,45,69,0,null,"KSOIL",6.7632287912901295E-2,1.0982638763412E-2,6.15810911838543,1.69129017958203E-9]
[74,100,120,2005,15,63,93,0,null,"DCLAY",-9.2966107938057601,2.44179543787327,-3.80728485671299,1.60919576848023E-4]
[75,78.5,0,2005,16,8,77,0,null,"KSOIL*KRATE",-7.0926185930713596E-4,1.2399222892968301E-4,-5.7202121893410096,1.9952072499410899E-8,null,null,"K rate","Exp. Yield"]
[76,85.9,30,2005,16,14,77,0,null,"DCLFIELD*KRATE",-2.1130216011934499E-2,9.4468218525947407E-3,-2.2367539413406701,2.5814344277088699E-2,null,null,0.01,{"$f":"(+$K$69+IF($U$16=\"Yes\",$K$70,0)+Q77*($U$12*$K$76+$K$71+IF($U$10=\"Clearfield\",$K$77,0)+IF($U$14=\"Clay\",$K$78,0))+Q77^0.5*($K$72)+IF($U$14=\"Clay\",$K$75,0)+IF($U$10=\"Clearfield\",$K$73,0)+$U$12*$K$74)*$U$60","v":173.40041407627885}]
[77,94.9,60,2005,16,28,66,0,null,"DCLAY*KRATE",9.2406560478107802E-2,2.7666102147056101E-2,3.3400643136113199,9.1062959029147102E-4,null,null,2,175.37448271729784]
[78,96.6,90,2005,16,46,69,0,null,null,null,null,null,null,null,null,7,177.08863521093923]
[79,100,120,2005,16,64,80,0,null,null,"Effects Specification",null,null,null,null,null,15,178.66616097564972]
[80,98.6,0,2006,17,1,151,0,null,null,null,null,"S.D.  ","Rho  ",null,null,25,180]
[81,98.1,40,2006,17,15,151,0,null,null,null,null,null,null,null,null,45,181.81201135919036]
[82,95.3,80,2006,17,37,151,0,null,"Period random",null,null,1.09988001926412,5.2379790785103401E-2,null,null,60,182.78947046556192]
[83,100,120,2006,17,57,151,0,null,"Idiosyncratic random",null,null,4.6782194465974003,0.94762020921489598,null,null,70,183.3294805862167]
[84,90.6,160,2006,17,71,151,0,null,null,null,null,null,null,null,null,80,183.80214165492671]
[85,86.4,0,2006,18,2,71,0,null,null,"Weighted Statistics",null,null,null,null,null,90,184.21976180769644]
[86,94.3,40,2006,18,16,76,0,null,null,null,null,null,null,null,null,100,184.59130252343323]
[87,94.9,80,2006,18,38,85,0,null,"R-squared",0.31310372894456001,"    Mean dependent var",null,58.6943381945228,null,null,110,184.92352899484598]
[88,95.5,120,2006,18,58,98,0,null,"Adjusted R-squared",0.29872683024805102,"    S.D. dependent var",null,10.0022922776174,null,null,120,185.22169710371608]
[89,100,160,2006,18,72,100,0,null,"S.E. of regression",4.6850694834181299,"    Sum squared resid",null,9438.4467077160407,null,null,130,185.48998657691288]
[90,91.3,0,2006,19,3,116,0,null,"F-statistic",21.778252428013801,"    Durbin-Watson stat",null,2.4409488046449499,null,null,140,185.73178632091404]
[91,93.6,40,2006,19,17,116,0,null,"Prob(F-statistic)",1.97587979995919E-30,null,null,null,null,null,150,185.94988928056159]
[92,100,80,2006,19,39,116,0,null,null,null,null,null,null,null,null,160,186.14662959543867]
[93,94.8,120,2006,19,59,116,0,null,null,"Unweighted Statistics",null,null,null,null,null,170,186.32398165788015]
[94,94.8,160,2006,19,73,116,0,null,null,null,null,null,null,null,null,180,186.48363326015524]
[95,99.4,0,2006,20,4,104,0,null,"R-squared",0.31196952181203802,"    Mean dependent var",null,95.920454545454504]
[96,100,40,2006,20,18,104,0,null,"Sum squared resid",9886.4034506796197,"    Durbin-Watson stat",null,2.4312777860733799]
[97,97.4,80,2006,20,40,104,0]
[98,98.7,120,2006,20,60,104,0]
[99,98.7,160,2006,20,74,104,0]
[100,97.9,0,2006,21,5,121,0,null,"Dependent Variable: RELYLD",null,null,null,null,null,null,"Predicted RELYLD based on above questions:",null,null,null,{"$f":"+K112+IF($U$16=\"Yes\",K113,0)+LN($U$6)*(K117+$U$12*K120+IF($U$10=\"Clearfield\",K119,0)+IF($U$14=\"Clay\",K118))+IF($U$14=\"Clay\",K116,0)+IF($U$10=\"Clearfield\",K114,0)+$U$12*K115","v":96.183932265481602}]
[101,88,40,2006,21,19,121,0,null,"Method: Panel EGLS (Period random effects)"]
[102,95.8,80,2006,21,41,121,0,null,"Date: 03/13/19   Time: 16:57",null,null,null,null,null,null,"Yield/RELYLD",null,null,null,{"$f":"+U8/U101","v":1.871414442728063}]
[103,99.5,120,2006,21,61,121,0,null,"Sample: 2001 2018 IF KRATE<>135"]
[104,100,160,2006,21,75,121,0,null,"Periods included: 17",null,null,null,null,null,null,"dRELYLD/dKRATE",null,null,null,{"$f":"(K117+IF(U14=\"Clay\",K118,0)+IF(U10=\"Clearfield\",K119,0)+U12*K120)/U6","v":1.7019495542632695E-2},null,{"$f":"(K117+IF(U14=\"Clay\",K118,0)+IF(U10=\"Clearfield\",K119,0)+U12*K120)/U111","v":4.4485068672785247E-2}]
[105,103.3,0,2006,22,6,133,0,null,"Cross-sections included: 79"]
[106,100,80,2006,22,42,133,0,null,"Total panel (unbalanced) observations: 440",null,null,null,null,null,null,{"$f":"CONCATENATE(\"VMP of K @ KRATE =  \",U49,\" lbs/acre and soil test K of \",U55)","v":"VMP of K @ KRATE =   lbs/acre and soil test K of "},null,null,null,{"$f":"+U105*U2/2.22*U103","v":0.14347085480373295},null,{"$f":"+W105*U2/2.22*U103","v":0.37500000000000006}]
[107,100,140,2006,22,68,133,0,null,"Wallace and Hussain estimator of component variances"]
[108,96.5,0,2007,23,1,92,0,null,null,null,null,null,null,null,null,"Cost per lb of K",null,null,null,{"$f":"+U4/0.6/2000","v":0.375},null,{"$f":"(K117+IF(U14=\"Clay\",K118,0)+IF(U10=\"Clearfield\",K119,0)+U12*K120)/W111*U2/2.22*U103","v":0.71735427401866481},"VMP at Alt User K"]
[109,96.5,40,2007,23,15,92,0,null,"Variable","Coefficient","Std. Error","t-Statistic","Prob.  "]
[110,100,80,2007,23,37,92,0,null,null,null,null,null,null,null,null,"Optimal K",null,null,null,{"$f":"IF(((K117+IF(U14=\"Clay\",K118,0)+IF(U10=\"Clearfield\",K119,0)+U12*K120)/(U109/(U2/2.22*U103)))>180,180,((K117+IF(U14=\"Clay\",K118,0)+IF(U10=\"Clearfield\",K119,0)+U12*K120)/(U109/(U2/2.22*U103))))","v":9.5647236535821953},null,5,"Alt User K"]
[111,97.8,120,2007,23,57,92,0,null,"C",92.048356264197906,0.81185646957784696,113.380085906147,0]
[112,98.7,160,2007,23,71,92,0,null,"DRREC",1.6742729270431,0.62470994594087303,2.6800804724206602,7.6425083668557299E-3,null,null,"Expected Yield",null,null,null,{"$f":"(+K112+IF(U16=\"Yes\",K113,0)+LN(U111)*(K117+IF(U10=\"Clearfield\",K119,0)+IF(U14=\"Clay\",K118,0)+U12*K120)+IF(U14=\"Clay\",K116,0)+IF(U10=\"Clearfield\",K114,0)+U12*K115)*U103","v":179.23495496196571},null,{"$f":"(+K112+IF(U16=\"Yes\",K113,0)+LN(W111)*(K117+IF(U10=\"Clearfield\",K119,0)+IF(U14=\"Clay\",K118,0)+U12*K120)+IF(U14=\"Clay\",K116,0)+IF(U10=\"Clearfield\",K114,0)+U12*K115)*U103","v":178.71846374657}]
[113,93.7,0,2007,24,2,104,0,null,"DCLFIELD",0.95387617661894897,0.59935237500280203,1.5915114653787601,0.11222766173396501]
[114,100,40,2007,24,16,104,0,null,"KSOIL",2.5145317567662698E-2,7.9073504817691407E-3,3.179992796024,1.57907971855337E-3,null,null,"Added Profit in $/acre",null,null,null,{"$f":"+(U113-U8)*U2/2.22-(U111-U6)*U109","v":2.3420798099324087},null,{"$f":"+(W113-U8)*U2/2.22-(W111-U6)*U109","v":1.7273141737387165}]
[115,98.9,80,2007,24,38,104,0,null,"DCLAY",-3.4884119486487601,1.6463808393911099,-2.1188365809328,3.4675694186571397E-2]
[116,100,120,2007,24,58,104,0,null,"LNK",0.94669112850294701,0.118705368908325,7.9751331991905596,1.38311928799235E-14]
[117,97.4,160,2007,24,72,104,0,null,"LNK*DCLAY",0.49900023733202897,0.24385593113290899,2.0462911646797601,4.1333966755333698E-2,null,null,"K rate","Exp. Yield"]
[118,101.4,0,2007,25,3,101,0,null,"LNK*DCLFIELD",-0.14964556390544001,9.1935393442375696E-2,-1.6277252786135701,0.10431391173181299,null,null,0.01,{"$f":"(+$K$112+IF($U$16=\"Yes\",$K$113,0)+LN(Q119)*($K$117+IF($U$10=\"Clearfield\",$K$119,0)+IF($U$14=\"Clay\",$K$118,0)+$U$12*$K$120)+IF($U$14=\"Clay\",$K$116,0)+IF($U$10=\"Clearfield\",$K$114,0)+$U$12*$K$115)*$U$103","v":173.76999974093286}]
[119,99.5,40,2007,25,17,101,0,null,"LNK*KSOIL",-4.7382158176102699E-3,1.1344859832762E-3,-4.17653094657644,3.5839426616793697E-5,null,null,2,177.98885511581346]
[120,95.2,80,2007,25,39,101,0,null,null,null,null,null,null,null,null,5,178.71846374657]
[121,98.1,120,2007,25,59,101,0,null,null,"Effects Specification",null,null,null,null,null,7,178.986384221272]
[122,100,160,2007,25,73,101,0,null,null,null,null,"S.D.  ","Rho  ",null,null,10,179.2703913692435]
[123,100,0,2007,26,4,132,0,null,null,null,null,null,null,null,null,15,179.59324833161969]
[124,100,40,2007,26,18,132,0,null,"Period random",null,null,1.1064707345190701,5.0323337690711199E-2,null,null,30,180.14517595429319]
[125,87.4,80,2007,26,40,132,0,null,"Idiosyncratic random",null,null,4.8066565925013904,0.94967666230928804,null,null,50,180.55192762267356]
[126,98.2,120,2007,26,60,132,0,null,null,null,null,null,null,null,null,70,180.81984809737557]
[127,92.8,160,2007,26,74,132,0,null,null,"Weighted Statistics",null,null,null,null,null,90,181.01996053934292]
[128,97.8,0,2007,27,5,150,0,null,null,null,null,null,null,null,null,100,181.10385524534706]
[129,100,40,2007,27,19,150,0,null,"R-squared",0.27404288091336698,"    Mean dependent var",null,59.438929627391701,null,null,110,181.17974723831961]
[130,97.2,80,2007,27,41,150,0,null,"Adjusted R-squared",0.26056803879575002,"    S.D. dependent var",null,9.9541078865655201,null,null,120,181.24903119964026]
[131,98.9,120,2007,27,61,150,0,null,"S.E. of regression",4.8127962685283698,"    Sum squared resid",null,9983.2564145374308,null,null,130,181.31276626572378]
[132,98.3,160,2007,27,75,150,0,null,"F-statistic",20.337372306208898,"    Durbin-Watson stat",null,2.37121624282072,null,null,140,181.37177572004907]
[133,86.9,0,2007,28,6,81,0,null,"Prob(F-statistic)",3.8906473912959599E-26,null,null,null,null,null,150,181.42671220772326]
[134,96.2,40,2007,28,20,81,0,null,null,null,null,null,null,null,null,160,181.47810185993757]
[135,95.6,80,2007,28,42,81,0,null,null,"Unweighted Statistics",null,null,null,null,null,170,181.52637501798117]
[136,100,120,2007,28,62,81,0,null,null,null,null,null,null,null,null,180,181.57188816201642]
[137,100,160,2007,28,76,81,0,null,"R-squared",0.27346398363038699,"    Mean dependent var",null,95.920454545454504]
[138,81.2,0,2007,29,7,56,0,null,"Sum squared resid",10439.6947620644,"    Durbin-Watson stat",null,2.36409625502798]
[139,94.2,40,2007,29,21,61,0]
[140,96.9,80,2007,29,43,78,0]
[141,99,120,2007,29,63,87,0,null,null,null,null,null,null,null,null,null,null,null,null,null,null,false]
[142,100,160,2007,29,77,121,0,null,{"$f":"0.8301513*2.47105*0.453592","v":0.93047384900780505},null,null,null,null,null,null,"Profit-Maximizing K Rate Calculator for Rice\nas developed by Dr. M. Popp, Dr. N. Slaton, J. Norsworthy and Dr. B. Dixon"]
[143,84,0,2007,30,8,54,0]
[144,93.6,40,2007,30,22,64,0,null,"Dependent Variable: RELYLD",null,null,null,null,null,null,"What is your expected rice price?",null,null,null,12.499999999999998,{"$f":"IF(W142,CONCATENATE(\"$ kg\",Z155),\"$/cwt\")","v":"$/cwt"}]
[145,95.7,80,2007,30,44,70,0,null,"Method: Panel EGLS (Period random effects)"]
[146,99.5,120,2007,30,64,74,0,null,"Date: 01/31/20   Time: 14:06",null,null,null,null,null,null,"What do you expect to pay for muriate of potash fertilizer?",null,null,null,464.99999999999994,{"$f":"IF(W142,CONCATENATE(\"$ Mg\",Z155),\"$/ton\")","v":"$/ton"},{"$f":"+U147/IF(W142,1000,2000)/IF(W142,0.49809078131038,0.6)","v":0.38750000000000001},{"$f":"IF(W142,CONCATENATE(\"$ kg\",Z155,\" K\"),CONCATENATE(\"$/lb of K\",Z153,\"O\"))","v":"$/lb of K₂O"}]
[147,100,160,2007,30,78,99,0,null,"Sample: 2001 2018 IF KRATE<>135 AND DCLAY=0"]
[148,81.8,0,2006,31,7,60,0,null,"Periods included: 17",null,null,null,null,null,null,"What is the yield potential of your field?",null,null,null,175,{"$f":"IF(W142,CONCATENATE(\"kg ha\",Z155),\"bu/acre\")","v":"bu/acre"},{"$f":"+U149/100","v":1.75},"kg ha-1/relative yield % (100% = yield potential)"]
[149,94.9,40,2006,31,20,66,0,null,"Cross-sections included: 77",null,null,null,null,null,null,null,null,null,null,null,null,null,null,null,null,null,null,null,null,null,null,null,null,null,null,null,null,null,null,null,null,null,null,null,null,null,null,null,null,null,null,null,null,null,null,null,null,null,null,null,null,null,null,null,null,null,null,null,null,null,null,null,"Labels"]
[150,97.5,80,2006,31,43,67,0,null,"Total panel (unbalanced) observations: 414",null,null,null,null,null,null,"What is your soil test-K value (SK) and range?",null,null,null,95,{"$f":"IF(W142,CONCATENATE(\"mg K kg\",Z155),\"ppm\")","v":"ppm"},"Soil test range +/-",null,20,null,null,null,null,null,null,null,null,null,null,null,null,null,null,null,null,null,null,null,null,null,null,null,null,null,null,null,null,null,null,null,null,null,null,null,"High",{"$f":"MMULT($BJ$157:$BO$157,BJ160:BJ165)","v":0},0,0,0,0,0,{"$f":"SQRT(MMULT(BJ151:BO151,BR160:BR165))*1.96","v":0},null,null,null,null,null,{"$f":"CONCATENATE(TEXT(T156,0),\" \",BQ154,\" \",TEXT(BP151,\"0.0\"))","v":"0 ± 0.0"}]
[151,97.5,120,2006,31,62,81,0,null,"Wallace and Hussain estimator of component variances",null,null,null,null,null,null,null,null,null,null,null,null,"Max K recommendation:",null,{"$f":"180*IF(W142,BP172,1)","v":180},null,null,null,null,null,null,null,null,null,null,null,null,null,null,null,null,null,null,null,null,null,null,null,null,null,null,null,null,null,null,null,null,null,null,null,"Avg",{"$f":"MMULT($BJ$156:$BO$156,BJ160:BJ165)","v":-8.9222558738999425E-2},2.8651821845862699E-4,-1.4349144910815507E-3,2.4444421200340245E-2,-8.7903470180427485E-5,5.3922407088784042E-6,{"$f":"SQRT(MMULT(BJ152:BO152,BQ160:BQ165))*1.96","v":1.0206643104733022},"95% C.I. of profit maximizing rate at conditional mean",null,null,null,null,{"$f":"CONCATENATE(TEXT(U156,0),\" \",BQ154,\" \",TEXT(BP152,\"0.0\"))","v":"24 ± 1.0"}]
[152,100,160,2006,31,76,94,0,null,"White cross-section standard errors & covariance (d.f. corrected)",null,null,null,null,null,null,"What is your cost to apply fertilizer (equipment, labor, fuel or custom)?",null,null,null,5,{"$f":"IF(W142,CONCATENATE(\"$ ha\",Z155),\"$/acre\")","v":"$/acre"},{"$f":"CONCATENATE(\"...your rate in \",IF(W142,CONCATENATE(\"kg K ha\",Z155),CONCATENATE(\"lbs of K\",Z153,\"O/acre\")),\":\")","v":"...your rate in lbs of K₂O/acre:"},null,{"$f":"(223-1.825*U151)","v":49.625},"₂",null,null,null,null,null,null,null,null,null,null,null,null,null,null,null,null,null,null,null,null,null,null,null,null,null,null,null,null,null,null,null,null,null,null,"Low",{"$f":"MMULT($BJ$155:$BO$155,BJ160:BJ165)","v":-0.12345378496719173},{"$f":"MMULT($BJ$155:$BO$155,BK160:BK165)","v":3.1171594202273299E-4},-3.0157305903340051E-3,4.5782773898005891E-2,-1.583577366665828E-4,1.1238755687123693E-5,{"$f":"SQRT(MMULT(BJ153:BO153,BP160:BP165))*1.96","v":3.0919175573457713},null,null,null,null,null,{"$f":"CONCATENATE(TEXT(V156,0),\" \",BQ154,\" \",TEXT(BP153,\"0.0\"))","v":"94 ± 3.1"}]
[153,96.5,0,2001,32,1,153,0,null,"Variable","Coefficient","Std. Error","t-Statistic","Prob.  ","English",null,{"$f":"CONCATENATE(\"Profit change comparing applying at \",TEXT(ROUND(U156,1),\"0.0\"),IF(W142,CONCATENATE(\"kg K ha\",Z155),CONCATENATE(\"lb K\",Z153,\"O/acre\")),\" to no fertilizer:\")","v":"Profit change comparing applying at 23.9lb K₂O/acre to no fertilizer:"},null,null,null,{"$f":"+U160*$U$145/IF(W142,1,2.22222222222)-U156*$W$147-IF(U156>0,$U$153)-R165*$U$145/IF(W142,1,2.22222222222)","v":-4.2664589443699015},{"$f":"IF(W142,CONCATENATE(\"$ ha\",Z155),\"$/acre\")","v":"$/acre"},"...to your rate:",null,{"$f":"+U162","v":0.84421234340273443},{"$f":"CONCATENATE(\"lb Fertilizer-K\",Z153,\"O/acre\")","v":"lb Fertilizer-K₂O/acre"},null,null,null,null,null,null,null,null,null,null,null,null,null,null,null,null,null,null,null,null,null,null,null,null,null,null,null,null,null,null,null,null,null,null,null,null,null,null,null,null,null,null,"±"]
[154,96.5,60,2001,32,27,153,0,null,null,null,null,null,null,null,null,null,null,null,{"$f":"CONCATENATE(U151+Y151,\" ppm soil K\")","v":"115 ppm soil K"},{"$f":"CONCATENATE(U151,\" ppm soil K\")","v":"95 ppm soil K"},{"$f":"CONCATENATE(U151-Y151,\" ppm soil K\")","v":"75 ppm soil K"},"K yield max",null,null,"⁻¹",null,null,null,null,null,null,null,null,null,null,null,null,null,null,null,null,null,null,null,null,null,null,null,null,null,null,null,null,null,null,null,null,null,null,"Low",{"$f":"+V156","v":93.93366237786816},{"$f":"+BJ155^2","v":8823.532927719325},{"$f":"+(U151-Y151)*BJ155","v":7045.0246783401117},{"$f":"+(U151-Y151)^0.5*BJ155","v":813.48937889744411},{"$f":"+(U151-Y151)^0.5*BK155","v":76414.036665334192},{"$f":"+(U151-Y151)*BK155","v":661764.96957894939}]
[155,100,120,2001,32,57,153,0,null,"C",11.7503964056384,25.152617371106501,0.46716396279046402,0.64063380697710304,11.7503964082027,null,"Profit Maximizing K rate:",null,null,{"$f":"IF((IF(W142,K159,O159)+2*IF(W142,K160,O160)*0.1+IF(W142,K161,O161)*(U151+Y151)+IF(W142,K162,O162)*(U151+Y151)^0.5+2*IF(W142,K163,O163)*(U151+Y151)^0.5*0.1+2*IF(W142,K164,O164)*(U151+Y151)*0.1)<0,0,IF(((IF(W142,K159,O159)+2*IF(W142,K160,O160)*Y152+IF(W142,K161,O161)*(U151+Y151)+IF(W142,K162,O162)*(U151+Y151)^0.5+2*IF(W142,K163,O163)*(U151+Y151)^0.5*Y152+2*IF(W142,K164,O164)*(U151+Y151)*Y152)*U145/IF(W142,1,2.2222222222222)*W149)>W147,IF(Y152<T188,Y152,T188),IF((W147/(U145/IF(W142,1,2.2222222222222)*W149)-IF(W142,K159,O159)-IF(W142,K161,O161)*(U151+Y151)-IF(W142,K162,O162)*(U151+Y151)^0.5)/(2*(IF(W142,K160,O160)+IF(W142,K163,O163)*(U151+Y151)^0.5+IF(W142,K164,O164)*(U151+Y151)))<0,0,IF((W147/(U145/IF(W142,1,2.2222222222222)*W149)-IF(W142,K159,O159)-IF(W142,K161,O161)*(U151+Y151)-IF(W142,K162,O162)*(U151+Y151)^0.5)/(2*(IF(W142,K160,O160)+IF(W142,K163,O163)*(U151+Y151)^0.5+IF(W142,K164,O164)*(U151+Y151)))>T188,T188,(W147/(U145/IF(W142,1,2.2222222222222)*W149)-IF(W142,K159,O159)-IF(W142,K161,O161)*(U151+Y151)-IF(W142,K162,O162)*(U151+Y151)^0.5)/(2*(IF(W142,K160,O160)+IF(W142,K163,O163)*(U151+Y151)^0.5+IF(W142,K164,O164)*(U151+Y151)))))))","v":0},{"$f":"IF((IF(W142,K159,O159)+2*IF(W142,K160,O160)*0.1+IF(W142,K161,O161)*(U151)+IF(W142,K162,O162)*(U151)^0.5+2*IF(W142,K163,O163)*(U151)^0.5*0.1+2*IF(W142,K164,O164)*(U151)*0.1)<0,0,IF(((IF(W142,K159,O159)+2*IF(W142,K160,O160)*Y152+IF(W142,K161,O161)*(U151)+IF(W142,K162,O162)*(U151)^0.5+2*IF(W142,K163,O163)*(U151)^0.5*Y152+2*IF(W142,K164,O164)*(U151)*Y152)*U145/IF(W142,1,2.2222222222222)*W149)>W147,IF(Y152<U188,Y152,U188),IF((W147/(U145/IF(W142,1,2.2222222222222)*W149)-IF(W142,K159,O159)-IF(W142,K161,O161)*(U151)-IF(W142,K162,O162)*(U151)^0.5)/(2*(IF(W142,K160,O160)+IF(W142,K163,O163)*(U151)^0.5+IF(W142,K164,O164)*(U151)))<0,0,IF((W147/(U145/IF(W142,1,2.2222222222222)*W149)-IF(W142,K159,O159)-IF(W142,K161,O161)*(U151)-IF(W142,K162,O162)*(U151)^0.5)/(2*(IF(W142,K160,O160)+IF(W142,K163,O163)*(U151)^0.5+IF(W142,K164,O164)*(U151)))>U188,U188,(W147/(U145/IF(W142,1,2.2222222222222)*W149)-IF(W142,K159,O159)-IF(W142,K161,O161)*(U151)-IF(W142,K162,O162)*(U151)^0.5)/(2*(IF(W142,K160,O160)+IF(W142,K163,O163)*(U151)^0.5+IF(W142,K164,O164)*(U151)))))))","v":23.941192262483554},{"$f":"IF((IF(W142,K159,O159)+2*IF(W142,K160,O160)*0.1+IF(W142,K161,O161)*(U151-Y151)+IF(W142,K162,O162)*(U151-Y151)^0.5+2*IF(W142,K163,O163)*(U151-Y151)^0.5*0.1+2*IF(W142,K164,O164)*(U151-Y151)*0.1)<0,0,IF(((IF(W142,K159,O159)+2*IF(W142,K160,O160)*Y152+IF(W142,K161,O161)*(U151-Y151)+IF(W142,K162,O162)*(U151-Y151)^0.5+2*IF(W142,K163,O163)*(U151-Y151)^0.5*Y152+2*IF(W142,K164,O164)*(U151-Y151)*Y152)*U145/IF(W142,1,2.2222222222222)*W149)>W147,IF(Y152<V188,Y152,V188),IF((W147/(U145/IF(W142,1,2.2222222222222)*W149)-IF(W142,K159,O159)-IF(W142,K161,O161)*(U151-Y151)-IF(W142,K162,O162)*(U151-Y151)^0.5)/(2*(IF(W142,K160,O160)+IF(W142,K163,O163)*(U151-Y151)^0.5+IF(W142,K164,O164)*(U151-Y151)))<0,0,IF((W147/(U145/IF(W142,1,2.2222222222222)*W149)-IF(W142,K159,O159)-IF(W142,K161,O161)*(U151-Y151)-IF(W142,K162,O162)*(U151-Y151)^0.5)/(2*(IF(W142,K160,O160)+IF(W142,K163,O163)*(U151-Y151)^0.5+IF(W142,K164,O164)*(U151-Y151)))>V188,V188,(W147/(U145/IF(W142,1,2.2222222222222)*W149)-IF(W142,K159,O159)-IF(W142,K161,O161)*(U151-Y151)-IF(W142,K162,O162)*(U151-Y151)^0.5)/(2*(IF(W142,K160,O160)+IF(W142,K163,O163)*(U151-Y151)^0.5+IF(W142,K164,O164)*(U151-Y151)))))))","v":93.93366237786816},{"$f":"+U187","v":175.33525159362804},null,null,{"$f":"CONCATENATE(\"Yield in kg ha\",Z155)","v":"Yield in kg ha⁻¹"},null,null,null,null,null,null,null,null,null,null,null,null,null,null,null,null,null,null,null,null,null,null,null,null,null,null,null,null,null,null,null,null,null,null,"Avg",{"$f":"+U156","v":23.941192262483554},{"$f":"+BJ156^2","v":573.18068694920237},{"$f":"+U151*BJ156","v":2274.4132649359376},{"$f":"U151^0.5*BJ156","v":233.34987735195881},{"$f":"+U151^0.5*BK156","v":5586.6742781102021},{"$f":"U151*BK156","v":54452.165260174224}]
[156,94.8,180,2001,32,79,153,0,null,"KSOIL",-0.55307111733229697,0.26971976046010998,-2.0505398506539501,4.0954893495914801E-2,-0.55307111736276604,null,"VMP @ Profit Max:",null,null,{"$f":"IF((K159+2*K160*T156+K161*(U151+Y151)+K162*(U151+Y151)^0.5+2*K163*(U151+Y151)^0.5*T156+2*K164*(U151+Y151)*T156)*U145*W149<0,\"na\",(K159+2*K160*T156+K161*(U151+Y151)+K162*(U151+Y151)^0.5+2*K163*(U151+Y151)^0.5*T156+2*K164*(U151+Y151)*T156)*U145*W149)","v":0.21846815731258043},{"$f":"IF((K159+2*K160*U156+K161*(U151)+K162*(U151)^0.5+2*K163*(U151)^0.5*U156+2*K164*(U151)*U156)*U145*W149<0,\"na\",(K159+2*K160*U156+K161*(U151)+K162*(U151)^0.5+2*K163*(U151)^0.5*U156+2*K164*(U151)*U156)*U145*W149)","v":0.91449028115078079},{"$f":"IF((K159+2*K160*V156+K161*(U151-Y151)+K162*(U151-Y151)^0.5+2*K163*(U151-Y151)^0.5*V156+2*K164*(U151-Y151)*V156)*U145*W149<0,\"na\",(K159+2*K160*V156+K161*(U151-Y151)+K162*(U151-Y151)^0.5+2*K163*(U151-Y151)^0.5*V156+2*K164*(U151-Y151)*V156)*U145*W149)","v":0.80751702352875343},null,null,null,{"$f":"CONCATENATE(\"kg Fertilizer-K ha\",Z155)","v":"kg Fertilizer-K ha⁻¹"},null,null,null,null,null,null,null,null,null,null,null,null,null,null,null,null,null,null,null,null,null,null,null,null,null,null,null,null,null,null,null,null,null,null,"High",{"$f":"+T156","v":0},{"$f":"+BJ157^2","v":0},{"$f":"+(U151+Y151)*BJ157","v":0},{"$f":"+(U151+Y151)^0.5*BJ157","v":0},{"$f":"+(U151+Y151)^0.5*BK157","v":0},{"$f":"(U151+Y151)*BK157","v":0}]
[157,95.3,0,2002,33,1,113,0,null,"KSOIL^.5",13.8958626089189,5.2541612590829896,2.6447347014515001,8.4934227193953406E-3,13.895862608853999,null,"UAEX recommendation:",null,null,{"$f":"IF((U151+Y151)<61,120*IF(W142,BP172,1),IF((U151+Y151)<=90,90*IF(W142,BP172,1),IF((U151+Y151)<=130,60*IF(W142,BP172,1),0)))","v":60},{"$f":"+Y153","v":49.625},{"$f":"IF((U151-Y151)<61,120*IF(W142,BP172,1),IF((U151-Y151)<=90,90*IF(W142,BP172,1),IF((U151-Y151)<=130,60*IF(W142,BP172,1),0)))","v":90},null,null,null,null,null,null,null,null,null,null,null,null,null,null,null,null,null,null,null,null,null,null,null,null,null,null,null,null,null,null,null,null,null,null,null,null,null,null,null,"Coefficient Covariance Matrix as available in Eviews under the View Menu in the Equation Editor"]
[158,100,60,2002,33,27,113,0,null,"MKRATE",1.4684301155361199,0.37841355948750799,3.8804902169067099,1.2165668866216E-4,1.3663875707714299,null,null,null,null,null,null,null,"Est. Yield Max",null,null,null,null,null,null,null,null,null,null,null,null,null,null,null,null,null,null,null,null,null,null,null,null,null,null,null,null,null,null,null,null,null,null,null,null,null,null,"K","K^2","S*K","S^.5*K","S^.5*K^2","S*K^2","Low","Avg","High",null,null,null,null,"English"]
[159,98.4,120,2002,33,57,113,0,null,"MKRATE^2",-6.5368691857022199E-3,1.6326724102630199E-3,-4.0037849262419396,7.4151892421772902E-5,-5.6599296638349603E-3,null,"Est. Yield at Profit-Max K:",null,null,{"$f":"IF((+K156+K157*(U151+Y151)+K158*(U151+Y151)^0.5+IF(W142,K159,O159)*T156+IF(W142,K160,O160)*T156^2+IF(W142,K161,O161)*(U151+Y151)*T156+IF(W142,K162,O162)*(U151+Y151)^0.5*T156+IF(W142,K163,O163)*(U151+Y151)^0.5*T156^2+IF(W142,K164,O164)*(U151+Y151)*T156^2)*W149>U149,U149,(+K156+K157*(U151+Y151)+K158*(U151+Y151)^0.5+IF(W142,K159,O159)*T156+IF(W142,K160,O160)*T156^2+IF(W142,K161,O161)*(U151+Y151)*T156+IF(W142,K162,O162)*(U151+Y151)^0.5*T156+IF(W142,K163,O163)*(U151+Y151)^0.5*T156^2+IF(W142,K164,O164)*(U151+Y151)*T156^2)*W149)","v":170.03655013319872},{"$f":"IF((+K156+K157*U151+K158*U151^0.5+IF(W142,K159,O159)*U156+IF(W142,K160,O160)*U156^2+IF(W142,K161,O161)*U151*U156+IF(W142,K162,O162)*U151^0.5*U156+IF(W142,K163,O163)*U151^0.5*U156^2+IF(W142,K164,O164)*(U151)*U156^2)*W149>U149,U149,(+K156+K157*U151+K158*U151^0.5+IF(W142,K159,O159)*U156+IF(W142,K160,O160)*U156^2+IF(W142,K161,O161)*U151*U156+IF(W142,K162,O162)*U151^0.5*U156+IF(W142,K163,O163)*U151^0.5*U156^2+IF(W142,K164,O164)*(U151)*U156^2)*W149)","v":167.41501129828038},{"$f":"IF((+K156+K157*(U151-Y151)+K158*(U151-Y151)^0.5+IF(W142,K159,O159)*V156+IF(W142,K160,O160)*V156^2+IF(W142,K161,O161)*(U151-Y151)*V156+IF(W142,K162,O162)*(U151-Y151)^0.5*V156+IF(W142,K163,O163)*(U151-Y151)^0.5*V156^2+IF(W142,K164,O164)*(U151-Y151)*V156^2)*W149>U149,U149,(+K156+K157*(U151-Y151)+K158*(U151-Y151)^0.5+IF(W142,K159,O159)*V156+IF(W142,K160,O160)*V156^2+IF(W142,K161,O161)*(U151-Y151)*V156+IF(W142,K162,O162)*(U151-Y151)^0.5*V156+IF(W142,K163,O163)*(U151-Y151)^0.5*V156^2+IF(W142,K164,O164)*(U151-Y151)*V156^2)*W149)","v":170.56128800214708},{"$f":"+U185","v":0},null,null,null,null,null,null,null,null,null,null,null,null,null,null,null,null,null,null,null,null,null,null,null,null,null,null,null,null,null,null,null,null,null,null,null,null,null,"KRATE",{"$f":"IF($W$142,BU167,BU160)","v":0.123986562636938},{"$f":"IF($W$142,BV167,BV160)","v":-4.4686879053749902E-4},1.34679676328023E-3,-2.62744223236623E-2,9.6270360539416706E-5,-4.9831347383266602E-6,{"$f":"+BJ155","v":93.93366237786816},{"$f":"+BJ156","v":23.941192262483554},{"$f":"+BJ157","v":0},null,null,0.123986562636938,-4.4686879053749902E-4,1.34679676328023E-3,-2.62744223236623E-2,9.6270360539416706E-5,-4.9831347383266602E-6]
[160,97.9,180,2002,33,79,113,0,null,"KSOIL*MKRATE",9.8570736147862905E-3,4.2930232321129998E-3,2.2960680811258198,2.2181965318339301E-2,9.1720966018110604E-3,null,"Est. Yield at UAEX rec.:",null,null,{"$f":"IF((+K156+K157*(U151+Y151)+K158*(U151+Y151)^0.5+IF(W142,K159,O159)*T158+IF(W142,K160,O160)*T158^2+IF(W142,K161,O161)*(U151+Y151)*T158+IF(W142,K162,O162)*(U151+Y151)^0.5*T158+IF(W142,K163,O163)*(U151+Y151)^0.5*T158^2+IF(W142,K164,O164)*(U151+Y151)*T158^2)*W149>U149,U149,(+K156+K157*(U151+Y151)+K158*(U151+Y151)^0.5+IF(W142,K159,O159)*T158+IF(W142,K160,O160)*T158^2+IF(W142,K161,O161)*(U151+Y151)*T158+IF(W142,K162,O162)*(U151+Y151)^0.5*T158+IF(W142,K163,O163)*(U151+Y151)^0.5*T158^2+IF(W142,K164,O164)*(U151+Y151)*T158^2)*W149)","v":170.95672540814269},{"$f":"IF((+K156+K157*U151+K158*U151^0.5+IF(W142,K159,O159)*U158+IF(W142,K160,O160)*U158^2+IF(W142,K161,O161)*U151*U158+IF(W142,K162,O162)*U151^0.5*U158+IF(W142,K163,O163)*U151^0.5*U158^2+IF(W142,K164,O164)*(U151)*U158^2)*W149>U149,U149,(+K156+K157*U151+K158*U151^0.5+IF(W142,K159,O159)*U158+IF(W142,K160,O160)*U158^2+IF(W142,K161,O161)*U151*U158+IF(W142,K162,O162)*U151^0.5*U158+IF(W142,K163,O163)*U151^0.5*U158^2+IF(W142,K164,O164)*(U151)*U158^2)*W149)","v":169.03425808137101},{"$f":"IF((+K156+K157*(U151-Y151)+K158*(U151-Y151)^0.5+IF(W142,K159,O159)*V158+IF(W142,K160,O160)*V158^2+IF(W142,K161,O161)*(U151-Y151)*V158+IF(W142,K162,O162)*(U151-Y151)^0.5*V158+IF(W142,K163,O163)*(U151-Y151)^0.5*V158^2+IF(W142,K164,O164)*(U151-Y151)*V158^2)*W149>U149,U149,(+K156+K157*(U151-Y151)+K158*(U151-Y151)^0.5+IF(W142,K159,O159)*V158+IF(W142,K160,O160)*V158^2+IF(W142,K161,O161)*(U151-Y151)*V158+IF(W142,K162,O162)*(U151-Y151)^0.5*V158+IF(W142,K163,O163)*(U151-Y151)^0.5*V158^2+IF(W142,K164,O164)*(U151-Y151)*V158^2)*W149)","v":170.2806225246876},null,null,null,null,null,null,null,null,null,null,null,null,null,null,null,null,null,null,null,null,null,null,null,null,null,null,null,null,null,null,null,null,null,null,null,null,null,null,"KRATE^2",{"$f":"IF($W$142,BU168,BU161)","v":-4.4686879053749902E-4},1.9983915662120902E-6,-4.59921180677411E-6,9.2051668602581601E-5,-4.0909937123589399E-7,2.03007188129212E-8,{"$f":"+BK155","v":8823.532927719325},{"$f":"+BK156","v":573.18068694920237},{"$f":"+BK157","v":0},null,null,-4.4686879053749902E-4,1.9983915662120902E-6,-4.59921180677411E-6,9.2051668602581601E-5,-4.0909937123589399E-7,2.03007188129212E-8]
[161,98.8,0,2001,34,2,113,0,null,"KSOIL^.5*MKRATE",-0.24170584920441901,8.1438236498550906E-2,-2.9679651671818799,3.1757267440942999E-3,-0.22490948983780901,null,"Added Profit in $/acre",null,null,{"$f":"+(T160-T161)*U145/IF(W142,1,2.2222222222222)-(T156-T158)*W147-IF(T158=0,IF(T156=0,0,U153),IF(T156=0,IF(T158>0,-U153,0)))","v":23.074014078440108},{"$f":"+(U160-U161)*U145/IF(W142,1,2.2222222222222)-(U156-U158)*W147-IF(U158=0,IF(U156=0,0,U153),IF(U156=0,IF(U158>0,-U153,0)))","v":0.84421234340273443},{"$f":"+(V160-V161)*U145/IF(W142,1,2.2222222222222)-(V156-V158)*W147-IF(V158=0,IF(V156=0,0,U153),IF(V156=0,IF(V158>0,-U153,0)))","v":5.4449139285672965E-2},{"$f":"+(U160-W160)*U145/IF(W142,1,2.2222222222222)-(U156-W156)*W147-IF(W156=0,IF(U156=0,0,U153),IF(U156=0,IF(W156>0,-U153,0)))","v":1000.3746365436549},null,null,null,null,null,null,null,null,null,null,null,null,null,null,null,null,null,null,null,null,null,null,null,null,null,null,null,null,null,null,null,null,null,null,null,null,null,"KSOIL*KRATE",1.34679676328023E-3,-4.59921180677411E-6,1.5957605253511301E-5,-3.0058459882647599E-4,1.0650795055224199E-6,-5.7770290936974003E-8,{"$f":"+BL155","v":7045.0246783401117},{"$f":"+BL156","v":2274.4132649359376},{"$f":"+BL157","v":0},null,null,1.34679676328023E-3,-4.59921180677411E-6,1.5957605253511301E-5,-3.0058459882647599E-4,1.0650795055224199E-6,-5.7770290936974003E-8]
[162,100,30,2001,34,13,113,0,null,"KSOIL^.5*MKRATE^2",1.1206267177696E-3,3.4249695860319999E-4,3.2719318803292001,1.1596937846575499E-3,9.7029146857346299E-4,null,null,null,null,{"$f":"+T161-T160","v":0.920175274943972},{"$f":"+U161-U160","v":1.619246783090631},{"$f":"+V161-V160","v":-0.28066547745947901},null,null,null,null,null,null,null,null,null,null,null,null,null,null,null,null,null,null,null,null,null,null,null,null,null,null,null,null,null,null,null,null,null,null,null,null,null,null,"KSOIL^.5*KRATE",-2.62744223236623E-2,9.2051668602581601E-5,-3.0058459882647599E-4,5.7424597733269304E-3,-2.0680544833325799E-5,1.10023103003826E-6,{"$f":"+BM155","v":813.48937889744411},{"$f":"+BM156","v":233.34987735195881},{"$f":"+BM157","v":0},null,null,-2.62744223236623E-2,9.2051668602581601E-5,-3.0058459882647599E-4,5.7424597733269304E-3,-2.0680544833325799E-5,1.10023103003826E-6]
[163,98.2,60,2001,34,28,113,0,null,"KSOIL*MKRATE^2",-4.7745273147867698E-5,1.7824731106945201E-5,-2.6785971054151898,7.6941866137480502E-3,-4.1340109482081801E-5,null,"K rate",{"$f":"CONCATENATE(\"Est. Yield (SK = \",U151,\")\")","v":"Est. Yield (SK = 95)"},{"$f":"CONCATENATE(\"Est. Yield (SK = \",U151-Y151,\")\")","v":"Est. Yield (SK = 75)"},{"$f":"CONCATENATE(\"Est. Yield (SK = \",U151+Y151,\")\")","v":"Est. Yield (SK = 115)"},null,null,null,null,null,null,"Year","Potash Fertilizer Price in $/ton","Rough Rice Price in $/cwt","Rough Rice Yield in bu/acre","lbs/acre",null,null,null,null,null,null,null,null,null,null,null,null,null,null,null,null,null,null,null,null,null,null,null,null,null,null,null,null,null,"KSOIL^.5*KRATE^2",9.6270360539416706E-5,-4.0909937123589399E-7,1.0650795055224199E-6,-2.0680544833325799E-5,8.7941915096477506E-8,-4.5209223802596702E-9,{"$f":"+BN155","v":76414.036665334192},{"$f":"+BN156","v":5586.6742781102021},{"$f":"+BN157","v":0},null,null,9.6270360539416706E-5,-4.0909937123589399E-7,1.0650795055224199E-6,-2.0680544833325799E-5,8.7941915096477506E-8,-4.5209223802596702E-9]
[164,98.2,90,2001,34,45,113,0,null,null,null,null,null,null,null,null,0,{"$f":"IF((+$K$156+$K$157*$U$151+$K$158*$U$151^0.5+$K$159*Q165+$K$160*Q165^2+$K$161*$U$151*Q165+$K$162*$U$151^0.5*Q165+$K$163*$U$151^0.5*Q165^2+$K$164*$U$151*Q165^2)*$W$149>$U$149,$U$149,(+$K$156+$K$157*$U$151+$K$158*$U$151^0.5+$K$159*Q165+$K$160*Q165^2+$K$161*$U$151*Q165+$K$162*$U$151^0.5*Q165+$K$163*$U$151^0.5*Q165^2+$K$164*$U$151*Q165^2)*$W$149)","v":165.63532186586571},{"$f":"IF((+$K$156+$K$157*($U$151-$Y$151)+$K$158*($U$151-$Y$151)^0.5+$K$159*Q165+$K$160*Q165^2+$K$161*($U$151-$Y$151)*Q165+$K$162*($U$151-$Y$151)^0.5*Q165+$K$163*($U$151-$Y$151)^0.5*Q165^2+$K$164*($U$151-$Y$151)*Q165^2)*$W$149>$U$149,$U$149,(+$K$156+$K$157*($U$151-$Y$151)+$K$158*($U$151-$Y$151)^0.5+$K$159*Q165+$K$160*Q165^2+$K$161*($U$151-$Y$151)*Q165+$K$162*($U$151-$Y$151)^0.5*Q165+$K$163*($U$151-$Y$151)^0.5*Q165^2+$K$164*($U$151-$Y$151)*Q165^2)*$W$149)","v":158.57058502938952},{"$f":"IF((+$K$156+$K$157*($U$151+$Y$151)+$K$158*($U$151+$Y$151)^0.5+$K$159*Q165+$K$160*Q165^2+$K$161*($U$151+$Y$151)*Q165+$K$162*($U$151+$Y$151)^0.5*Q165+$K$163*($U$151+$Y$151)^0.5*Q165^2+$K$164*($U$151+$Y$151)*Q165^2)*$W$149>$U$149,$U$149,(+$K$156+$K$157*($U$151+$Y$151)+$K$158*($U$151+$Y$151)^0.5+$K$159*Q165+$K$160*Q165^2+$K$161*($U$151+$Y$151)*Q165+$K$162*($U$151+$Y$151)^0.5*Q165+$K$163*($U$151+$Y$151)^0.5*Q165^2+$K$164*($U$151+$Y$151)*Q165^2)*$W$149)","v":170.03655013319872},{"$f":"ROUNDUP((MAX(BJ175:BJ588,U149)+IF(W142,500,10))/10,0)*10","v":190},null,null,null,null,null,2009,880,15,{"$f":"+AE165/45","v":157.44444444444446},7085,null,null,null,null,null,null,null,null,null,null,null,null,{"$f":"CONCATENATE(\"Obs. Yields (\",U151-Y151,\" < SK < \",U151+Y151,\")\")","v":"Obs. Yields (75 < SK < 115)"},null,null,null,null,null,null,null,null,null,null,null,null,null,null,null,null,"KSOIL*KRATE^2",-4.9831347383266602E-6,2.03007188129212E-8,-5.7770290936974003E-8,1.10023103003826E-6,-4.5209223802596702E-9,2.3819270391613401E-10,{"$f":"+BO155","v":661764.96957894939},{"$f":"+BO156","v":54452.165260174224},{"$f":"+BO157","v":0},null,null,-4.9831347383266602E-6,2.03007188129212E-8,-5.7770290936974003E-8,1.10023103003826E-6,-4.5209223802596702E-9,2.3819270391613401E-10]
[165,97.5,120,2001,34,58,113,0,null,null,"Effects Specification",null,null,null,null,null,2,{"$f":"IF((+$K$156+$K$157*$U$151+$K$158*$U$151^0.5+$K$159*Q166+$K$160*Q166^2+$K$161*$U$151*Q166+$K$162*$U$151^0.5*Q166+$K$163*$U$151^0.5*Q166^2+$K$164*$U$151*Q166^2)*$W$149>$U$149,$U$149,(+$K$156+$K$157*$U$151+$K$158*$U$151^0.5+$K$159*Q166+$K$160*Q166^2+$K$161*$U$151*Q166+$K$162*$U$151^0.5*Q166+$K$163*$U$151^0.5*Q166^2+$K$164*$U$151*Q166^2)*$W$149)","v":165.80575296883805},{"$f":"IF((+$K$156+$K$157*($U$151-$Y$151)+$K$158*($U$151-$Y$151)^0.5+$K$159*Q166+$K$160*Q166^2+$K$161*($U$151-$Y$151)*Q166+$K$162*($U$151-$Y$151)^0.5*Q166+$K$163*($U$151-$Y$151)^0.5*Q166^2+$K$164*($U$151-$Y$151)*Q166^2)*$W$149>$U$149,$U$149,(+$K$156+$K$157*($U$151-$Y$151)+$K$158*($U$151-$Y$151)^0.5+$K$159*Q166+$K$160*Q166^2+$K$161*($U$151-$Y$151)*Q166+$K$162*($U$151-$Y$151)^0.5*Q166+$K$163*($U$151-$Y$151)^0.5*Q166^2+$K$164*($U$151-$Y$151)*Q166^2)*$W$149)","v":158.96836309144607},{"$f":"IF((+$K$156+$K$157*($U$151+$Y$151)+$K$158*($U$151+$Y$151)^0.5+$K$159*Q166+$K$160*Q166^2+$K$161*($U$151+$Y$151)*Q166+$K$162*($U$151+$Y$151)^0.5*Q166+$K$163*($U$151+$Y$151)^0.5*Q166^2+$K$164*($U$151+$Y$151)*Q166^2)*$W$149>$U$149,$U$149,(+$K$156+$K$157*($U$151+$Y$151)+$K$158*($U$151+$Y$151)^0.5+$K$159*Q166+$K$160*Q166^2+$K$161*($U$151+$Y$151)*Q166+$K$162*($U$151+$Y$151)^0.5*Q166+$K$163*($U$151+$Y$151)^0.5*Q166^2+$K$164*($U$151+$Y$151)*Q166^2)*$W$149)","v":170.07143368829111},{"$f":"ROUNDDOWN((S165-IF(W142,500,10))/10,0)*10","v":140},null,null,null,null,null,2010,522,13.4,{"$f":"+AE166/45","v":149.44444444444446},6725,null,null,null,null,null,null,null,null,null,null,null,null,{"$f":"CONCATENATE(\"Estimated Yield Response to K Fertilizer and Profit-Maximizing Application Rates for a Range of Initial Soil-Test K Values at Specified Yield Potential\")","v":"Estimated Yield Response to K Fertilizer and Profit-Maximizing Application Rates for a Range of Initial Soil-Test K Values at Specified Yield Potential"},null,null,null,null,null,null,null,null,null,null,null,null,null,null,null,null,null,null,null,null,null,null,null,null,null,null,null,null,null,null,"Metric"]
[166,92.7,0,2002,35,2,65,0,null,null,null,null,"S.D.  ","Rho  ",null,null,5,166.05745813383857,159.55419280340513,170.1234914581384,null,null,null,null,null,null,2011,460,11.3,157.04444444444445,7067,null,null,null,null,null,null,null,null,null,null,null,null,null,null,null,null,null,null,null,null,null,null,null,null,null,null,null,null,null,null,null,null,null,null,null,null,null,null,null,null,null,0.14319682200400499,-5.5464891032687902E-4,1.5554670787692199E-3,-3.0345334984215499E-2,1.19489773512354E-4,-6.1850151798483198E-6]
[167,98.3,30,2002,35,13,65,0,null,null,null,null,null,null,null,null,7,166.22263391753356,159.93752102396076,170.15801826284257,null,null,null,null,null,null,2012,583.79999999999995,13.4,165.84444444444443,7463,null,null,null,null,null,null,null,null,null,null,null,null,null,null,null,null,null,null,null,null,null,null,null,null,null,null,null,null,null,null,null,null,null,null,null,null,null,null,null,null,null,-5.5464891032687902E-4,2.6656191992340901E-6,-5.7084940168221598E-6,1.1425357681197501E-4,-5.4569042265583803E-7,2.7078770120757901E-8]
[168,96.6,60,2002,35,28,65,0,null,"Period random",null,null,1.5609181910979999,0.13607184190379801,null,null,10,166.46645610361816,160.50167597366851,170.20954090710754,null,null,null,null,null,null,2013,596,14.3,170.97777777777779,7694,null,null,null,null,null,null,null,null,null,null,null,null,null,null,null,null,null,null,null,null,null,null,null,null,null,null,null,null,null,null,null,null,null,null,null,null,null,null,null,null,null,1.5554670787692199E-3,-5.7084940168221598E-6,1.8430048471462E-5,-3.4715664650393101E-4,1.3219656411560601E-6,-7.17038862426033E-8]
[169,95.5,90,2002,35,45,65,0,null,"Idiosyncratic random",null,null,3.93309851667702,0.86392815809620105,null,null,15,166.86231577520456,161.41303454017952,170.29469848010592,null,null,null,null,null,null,2014,475,15.2,168.35555555555555,7576,null,null,null,null,null,null,null,null,null,null,null,null,null,null,null,null,null,null,null,null,null,null,null,null,null,null,null,null,null,null,null,null,null,null,null,null,null,null,null,null,null,-3.0345334984215499E-2,1.1425357681197501E-4,-3.4715664650393101E-4,6.6321863639939097E-3,-2.5668477862596599E-5,1.3655953490491801E-6]
[170,100,120,2002,35,58,65,0,null,null,null,null,null,null,null,null,30,167.97106500080451,163.93036261719897,170.54481994327753,null,null,null,null,null,null,2015,472,12,166.04444444444445,7472,null,null,null,null,null,null,null,null,null,null,null,null,null,null,null,null,null,null,null,null,null,null,null,null,null,null,null,null,null,null,null,null,null,null,null,null,null,null,null,null,null,1.19489773512354E-4,-5.4569042265583803E-7,1.3219656411560601E-6,-2.5668477862596599E-5,1.17304166652442E-7,-6.0303784808555201E-9]
[171,94.5,0,2008,36,1,147,0,null,null,"Weighted Statistics",null,null,null,null,null,45,168.96156954266544,166.12256926044796,170.78691452271337,null,null,null,null,null,null,2016,425.4,10.9,160.82222222222222,7237,null,null,null,null,null,null,null,null,null,null,null,null,null,null,null,null,null,null,null,null,null,null,null,null,null,null,null,null,null,null,null,null,null,null,null,null,0.93050909005023585,"convert lbs of K20/acre to kg K ha-1",null,null,null,-6.1850151798483198E-6,2.7078770120757901E-8,-7.17038862426033E-8,1.3655953490491801E-6,-6.0303784808555201E-9,3.1772103903490201E-10]
[172,100,40,2008,36,15,147,0,null,null,null,null,null,null,null,null,60,169.83382940078741,167.98965446992617,171.02098221841345,null,null,null,null,null,null,2017,{"$f":"16.97*20","v":339.4},9.39,166.82222222222222,7507,null,null,null,null,null,null,null,null,null,null,null,null,null,null,null,null,null,null,null,null,null,null,null,null,null,null,null,null,null,null,"Actual RelYld Obs Converted to Yield",null,null,null,"Min Yield"]
[173,94.1,80,2008,36,37,147,0,null,"R-squared",0.51259978955642105,"    Mean dependent var",null,41.750752706526796,null,null,75,170.58784457517038,169.53161824563406,171.24702303037805,null,null,null,null,null,null,2018,{"$f":"22.2*20","v":444},11.1,170.93333333333334,7692,null,null,null,null,null,null,null,null,null,null,null,null,null,null,null,null,null,null,null,null,null,null,null,null,null,null,null,null,null,"RelYld","Yield","Krate","Ksoil",null,{"$f":"MIN(BN175:BN588)","v":132.30000000000001},null,"Mkrate"]
[174,93,120,2008,36,57,147,0,null,"Adjusted R-squared",0.50297213107852301,"    S.D. dependent var",null,9.8121271350192707,null,null,90,171.22361506581441,170.7484605875712,171.46503695860673,null,null,null,null,null,null,"Avg.",{"$f":"AVERAGE($AB$165:$AB$174)","v":519.76},{"$f":"AVERAGE($AC$165:$AC$174)","v":12.599},{"$f":"AVERAGE($AD$165:$AD$174)","v":163.37333333333336},null,null,null,null,null,null,null,null,null,null,null,null,null,null,null,null,null,null,null,null,null,null,null,null,null,null,null,null,null,null,{"$f":"_xlfn.NUMBERVALUE(IF(AND($G2>=($U$151-$Y$151),$G2<=($U$151+$Y$151)),B2,\"\"))","v":97.1},{"$f":"_xlfn.NUMBERVALUE(IFERROR(+BI175*$W$149,\"\"))","v":169.92500000000001},{"$f":"_xlfn.NUMBERVALUE(IF(AND($G2>=($U$151-$Y$151),$G2<=($U$151+$Y$151)),C2,\"\"))","v":0},{"$f":"_xlfn.NUMBERVALUE(IF(AND($G2>=($U$151-$Y$151),$G2<=($U$151+$Y$151)),G2,\"\"))","v":104},null,{"$f":"IF(BJ175=0,999,BJ175)","v":169.92500000000001},null,{"$f":"+BK175*$BP$172","v":0}]
[175,95,160,2008,36,71,147,0,null,"S.E. of regression",3.9389243709242501,"    Sum squared resid",null,6283.6257059437103,null,null,105,171.74114087271937,171.64018149573792,171.67502400309982,null,null,null,null,null,null,"Min.",{"$f":"MIN($AB$165:$AB$174)","v":339.4},{"$f":"MIN($AC$165:$AC$174)","v":9.39},{"$f":"MIN($AD$165:$AD$174)","v":149.44444444444446},null,null,null,null,null,null,null,null,null,null,null,null,null,null,null,null,null,null,null,null,null,null,null,null,null,null,null,null,null,null,{"$f":"_xlfn.NUMBERVALUE(IF(AND($G3>=($U$151-$Y$151),$G3<=($U$151+$Y$151)),B3,\"\"))","v":100},{"$f":"_xlfn.NUMBERVALUE(IFERROR(+BI176*$W$149,\"\"))","v":175},{"$f":"_xlfn.NUMBERVALUE(IF(AND($G3>=($U$151-$Y$151),$G3<=($U$151+$Y$151)),C3,\"\"))","v":40},{"$f":"_xlfn.NUMBERVALUE(IF(AND($G3>=($U$151-$Y$151),$G3<=($U$151+$Y$151)),G3,\"\"))","v":104},null,{"$f":"IF(BJ176=0,999,BJ176)","v":175},null,{"$f":"+BK176*$BP$172","v":37.220363602009435}]
[176,81.599999999999994,0,2008,38,2,104,0,null,"F-statistic",53.242415145197903,"    Durbin-Watson stat",null,2.1611636461572798,null,null,120,172.14042199588542,172.20678097013402,171.87698416385723,null,null,null,null,null,null,"Max.",{"$f":"MAX($AB$165:$AB$174)","v":880},{"$f":"MAX($AC$165:$AC$174)","v":15.2},{"$f":"MAX($AD$165:$AD$174)","v":170.97777777777779},null,null,null,null,null,null,null,null,null,null,null,null,null,null,null,null,null,null,null,null,null,null,null,null,null,null,null,null,null,null,99.5,174.125,80,104,null,174.125,null,74.44072720401887]
[177,95.3,60,2008,38,27,104,0,null,"Prob(F-statistic)",1.2195841432721601E-58,null,null,null,null,null,135,172.42145843531259,172.44825901075967,172.07091744087884,null,null,null,null,null,null,null,null,null,null,null,null,null,null,null,null,null,null,null,null,null,null,null,null,null,null,null,null,null,null,null,null,null,null,null,null,null,null,null,null,99.5,174.125,120,104,null,174.125,null,111.6610908060283]
[178,100,120,2008,38,58,104,0,null,null,null,null,null,null,null,null,150,172.58425019100068,172.36461561761476,172.25682383416472,null,null,null,null,null,null,null,null,null,null,null,null,null,null,null,null,null,null,null,null,null,null,null,null,null,null,null,null,null,null,null,null,null,null,null,null,null,null,null,null,98.6,172.55,160,104,null,172.55,null,148.88145440803774]
[179,94.3,0,2008,39,3,103,0,null,null,"Unweighted Statistics",null,null,null,null,null,165,172.62879726294972,171.955850790699,172.43470334371511,null,null,null,null,null,null,null,null,null,null,null,null,null,null,null,null,null,null,null,null,null,null,null,null,null,null,null,null,null,null,null,null,null,null,null,null,null,null,null,null,0,0,0,0,null,999,null,0]
[180,99.5,60,2008,39,28,103,0,null,null,null,null,null,null,null,null,180,172.55509965115996,171.22196453001291,172.60455596952957,null,null,null,null,null,null,null,null,null,null,null,null,null,null,null,null,null,null,null,null,null,null,null,null,null,null,null,null,null,null,null,null,null,null,null,null,null,null,null,null,0,0,0,0,null,999,null,0]
[181,100,120,2008,39,59,103,0,null,"R-squared",0.47510191544139502,"    Mean dependent var",null,95.858212560386406,null,null,null,165.63532186586571,158.57058502938952,170.03655013319872,null,null,null,null,null,null,null,null,null,null,null,null,null,null,null,null,null,null,null,null,null,null,null,null,null,null,null,null,null,null,null,null,null,null,null,null,null,null,null,null,0,0,0,0,null,999,null,0]
[182,91.4,0,2008,40,4,78,0,null,"Sum squared resid",7193.08109010924,"    Durbin-Watson stat",null,2.0362888164825401,null,null,null,165.63532186586571,158.57058502938952,170.03655013319872,null,null,null,null,null,null,null,null,null,null,null,null,null,null,null,null,null,null,null,null,null,null,null,null,null,null,null,null,null,null,null,null,null,null,null,null,null,null,null,null,0,0,0,0,null,999,null,0]
[183,96.1,60,2008,40,29,78,0,null,null,null,null,null,null,null,null,"Disclaimer:  This software is provided ‘as is’ and without warranties as to performance or merchantability. Further, statements may have been made to you about this software, and they do not constitute warranties and shall not be relied upon by the user to use the program or act on its results. This program is provided without any expressed or implied warranties whatsoever. Because the diversity of conditions and hardware under which this program may be used, no warranty of merchantability or warranty of fitness for a particular purpose is offered. The user is advised to test the program thoroughly before relying on it. The user assumes the entire risk of using the program. The authors will not be liable for any claim or damage brought against the user by any third party, nor will the authors be liable for any consequential, indirect, or special damages suffered by the user as a result of the software.  Results pertain to silt loam soils common in major rice producing regions of the humid mid-Southern U.S.",null,null,null,null,null,null,null,null,null,null,null,null,null,null,null,null,null,null,null,null,null,null,null,null,null,null,null,null,null,null,null,null,null,null,null,null,null,null,null,null,null,null,null,0,0,0,0,null,999,null,0]
[184,100,120,2008,40,60,78,0,null,null,null,null,null,null,null,null,null,null,null,null,null,null,null,null,null,null,null,null,null,null,null,null,null,null,null,null,null,null,null,null,null,null,null,null,null,null,null,null,null,null,null,null,null,null,null,null,null,null,null,null,92.5,161.875,0,87,null,161.875,null,0]
[185,83.7,0,2008,41,5,56,0,null,null,null,null,null,null,null,null,null,null,null,null,null,null,null,null,null,null,null,null,null,null,null,null,null,null,null,null,null,null,null,null,null,null,null,null,null,null,null,null,null,null,null,null,null,null,null,null,null,null,null,null,95.3,166.77500000000001,40,87,null,166.77500000000001,null,37.220363602009435]
[186,92.3,60,2008,41,30,56,0,null,null,null,null,null,null,null,null,null,"Potash fertilizer needed @ RY = 100 if possible or K max or zero if yield max at negative K:",null,{"$f":"IF((IF(W142,K159,O159)+IF(W142,K161,O161)*($U$151+$Y$151)+IF(W142,K162,O162)*($U$151+$Y$151)^0.5)/(-2*(IF(W142,K160,O160)+IF(W142,K163,O163)*($U$151+$Y$151)^0.5+IF(W142,K164,O164)*($U$151+$Y$151)))>$Y$152,$Y$152,(IF(W142,K159,O159)+IF(W142,K161,O161)*($U$151+$Y$151)+IF(W142,K162,O162)*($U$151+$Y$151)^0.5)/(-2*(IF(W142,K160,O160)+IF(W142,K163,O163)*($U$151+$Y$151)^0.5+IF(W142,K164,O164)*($U$151+$Y$151))))","v":180},{"$f":"IF((IF(W142,K159,O159)+IF(W142,K161,O161)*($U$151)+IF(W142,K162,O162)*($U$151)^0.5)/(-2*(IF(W142,K160,O160)+IF(W142,K163,O163)*($U$151)^0.5+IF(W142,K164,O164)*($U$151)))>$Y$152,$Y$152,(IF(W142,K159,O159)+IF(W142,K161,O161)*($U$151)+IF(W142,K162,O162)*($U$151)^0.5)/(-2*(IF(W142,K160,O160)+IF(W142,K163,O163)*($U$151)^0.5+IF(W142,K164,O164)*($U$151))))","v":175.33525159362804},{"$f":"IF((IF(W142,K159,O159)+IF(W142,K161,O161)*($U$151-$Y$151)+IF(W142,K162,O162)*($U$151-$Y$151)^0.5)/(-2*(IF(W142,K160,O160)+IF(W142,K163,O163)*($U$151-$Y$151)^0.5+IF(W142,K164,O164)*($U$151-$Y$151)))>$Y$152,$Y$152,(IF(W142,K159,O159)+IF(W142,K161,O161)*($U$151-$Y$151)+IF(W142,K162,O162)*($U$151-$Y$151)^0.5)/(-2*(IF(W142,K160,O160)+IF(W142,K163,O163)*($U$151-$Y$151)^0.5+IF(W142,K164,O164)*($U$151-$Y$151))))","v":148.99475896780453},null,null,null,null,null,null,null,null,null,null,null,null,null,null,null,null,null,null,null,null,null,null,null,null,null,null,null,null,null,null,null,null,null,null,null,null,null,null,96.7,169.22499999999999,80,87,null,169.22499999999999,null,74.44072720401887]
[187,100,120,2008,41,61,56,0,null,null,null,null,null,null,null,null,null,null,null,{"$f":"IF(T187<0,0,IFERROR((SQRT(T191^2+4*T192*T190)-T191)/(2*T192),$Y$152))","v":180},{"$f":"IF(U187<0,0,IFERROR((SQRT(U191^2+4*U192*U190)-U191)/(2*U192),$Y$152))","v":180},{"$f":"IF(V187<0,0,IFERROR((SQRT(V191^2+4*V192*V190)-V191)/(2*V192),$Y$152))","v":180},null,null,null,null,null,null,null,null,null,null,null,null,null,null,null,null,null,null,null,null,null,null,null,null,null,null,null,null,null,null,null,null,null,null,null,null,null,null,98.1,171.67500000000001,120,87,null,171.67500000000001,null,111.6610908060283]
[188,98.1,0,2009,42,1,146,0,null,null,null,null,null,null,null,null,null,null,null,null,null,null,null,null,null,null,null,null,null,null,null,null,null,null,null,null,null,null,null,null,null,null,null,null,null,null,null,null,null,null,null,null,null,null,null,null,null,null,null,null,100,175,160,87,null,175,null,148.88145440803774]
[189,100,45,2009,42,23,146,0,null,null,null,null,null,null,null,null,null,null,"c",{"$f":"100-$K$156-$K$157*(U151+Y151)-$K$158*(U151+Y151)^0.5","v":2.8362570667435989},{"$f":"100-$K$156-$K$157*U151-$K$158*U151^0.5","v":5.3512446480767437},{"$f":"100-$K$156-$K$157*(U151-Y151)-$K$158*(U151-Y151)^0.5","v":9.3882371260631174},null,null,null,null,null,null,null,null,null,null,null,null,null,null,null,null,null,null,null,null,null,null,null,null,null,null,null,null,null,null,null,null,null,null,null,null,null,null,0,0,0,0,null,999,null,0]
[190,98.6,90,2009,42,45,146,0,null,null,null,null,null,null,null,null,null,null,"a",{"$f":"IF(W142,K159,O159)+IF(W142,K161,O161)*(U151+Y151)+IF(W142,K162,O162)*(U151+Y151)^0.5","v":9.2931020144240151E-3},{"$f":"IF(W142,K159,O159)+IF(W142,K161,O161)*(U151)+IF(W142,K162,O162)*(U151)^0.5","v":4.5590204298454839E-2},{"$f":"IF(W142,K159,O159)+IF(W142,K161,O161)*(U151-Y151)+IF(W142,K162,O162)*(U151-Y151)^0.5","v":0.10652149838985303},null,null,null,null,null,null,null,null,null,null,null,null,null,null,null,null,null,null,null,null,null,null,null,null,null,null,null,null,null,null,null,null,null,null,null,null,null,null,0,0,0,0,null,999,null,0]
[191,68.400000000000006,0,2009,43,2,62,0,null,null,null,null,null,null,null,null,null,null,"b",{"$f":"+IF(W142,K160,O160)+IF(W142,K163,O163)*(U151+Y151)^0.5+IF(W142,K164,O164)*(U151+Y151)","v":-8.8254661223079178E-6},{"$f":"+IF(W142,K160,O160)+IF(W142,K163,O163)*(U151)^0.5+IF(W142,K164,O164)*(U151)","v":-1.3000866592451869E-4},{"$f":"+IF(W142,K160,O160)+IF(W142,K163,O163)*(U151-Y151)^0.5+IF(W142,K164,O164)*(U151-Y151)","v":-3.5746726639180205E-4},null,null,null,null,null,null,null,null,null,null,null,null,null,null,null,null,null,null,null,null,null,null,null,null,null,null,null,null,null,null,null,null,null,null,null,null,null,null,0,0,0,0,null,999,null,0]
[192,90.4,60,2009,43,27,62,0,null,null,null,null,null,null,null,null,null,null,null,null,null,null,null,null,null,null,null,null,null,null,null,null,null,null,null,null,null,null,null,null,null,null,null,null,null,null,null,null,null,null,null,null,null,null,null,null,null,null,null,null,0,0,0,0,null,999,null,0]
[193,100,120,2009,43,57,62,0,null,null,null,null,null,null,null,null,null,null,null,null,null,null,null,null,null,null,null,null,null,null,null,null,null,null,null,null,null,null,null,null,null,null,null,null,null,null,null,null,null,null,null,null,null,null,null,null,null,null,null,null,0,0,0,0,null,999,null,0]
[194,63.4,0,2009,44,3,66,0,null,null,null,null,null,null,null,null,null,null,null,null,null,null,null,null,null,null,null,null,null,null,null,null,null,null,null,null,null,null,null,null,null,null,null,null,null,null,null,null,null,null,null,null,null,null,null,null,null,null,null,null,96.6,169.05,0,76,null,169.05,null,0]
[195,84.1,40,2009,44,15,79,0,null,null,null,null,null,null,null,null,null,null,null,null,null,null,null,null,null,null,null,null,null,null,null,null,null,null,null,null,null,null,null,null,null,null,null,null,null,null,null,null,null,null,null,null,null,null,null,null,null,null,null,null,94.1,164.67500000000001,40,76,null,164.67500000000001,null,37.220363602009435]
[196,93.8,80,2009,44,37,86,0,null,null,null,null,null,null,null,null,null,null,null,null,null,null,null,null,null,null,null,null,null,null,null,null,null,null,null,null,null,null,null,null,null,null,null,null,null,null,null,null,null,null,null,null,null,null,null,null,null,null,null,null,100,175,80,76,null,175,null,74.44072720401887]
[197,92.4,120,2009,44,58,109,0,null,null,null,null,null,null,null,null,null,null,null,null,null,null,null,null,null,null,null,null,null,null,null,null,null,null,null,null,null,null,null,null,null,null,null,null,null,null,null,null,null,null,null,null,null,null,null,null,null,null,null,null,97.5,170.625,120,76,null,170.625,null,111.6610908060283]
[198,100,160,2009,44,71,116,0,null,null,null,null,null,null,null,null,null,null,null,null,null,null,null,null,null,null,null,null,null,null,null,null,null,null,null,null,null,null,null,null,null,null,null,null,null,null,null,null,null,null,null,null,null,null,null,null,null,null,null,null,98.5,172.375,160,76,null,172.375,null,148.88145440803774]
[199,93.9,0,2009,45,4,96,0,null,null,null,null,null,null,null,null,null,null,null,null,null,null,null,null,null,null,null,null,null,null,null,null,null,null,null,null,null,null,null,null,null,null,null,null,null,null,null,null,null,null,null,null,null,null,null,null,null,null,null,null,0,0,0,0,null,999,null,0]
[200,96.4,45,2009,45,24,96,0,null,null,null,null,null,null,null,null,null,null,null,null,null,null,null,null,null,null,null,null,null,null,null,null,null,null,null,null,null,null,null,null,null,null,null,null,null,null,null,null,null,null,null,null,null,null,null,null,null,null,null,null,0,0,0,0,null,999,null,0]
[201,100,90,2009,45,46,96,0,null,null,null,null,null,null,null,null,null,null,null,null,null,null,null,null,null,null,null,null,null,null,null,null,null,null,null,null,null,null,null,null,null,null,null,null,null,null,null,null,null,null,null,null,null,null,null,null,null,null,null,null,0,0,0,0,null,999,null,0]
[202,61.5,0,2010,46,1,35,0,null,null,null,null,null,null,null,null,null,null,null,null,null,null,null,null,null,null,null,null,null,null,null,null,null,null,null,null,null,null,null,null,null,null,null,null,null,null,null,null,null,null,null,null,null,null,null,null,null,null,null,null,0,0,0,0,null,999,null,0]
[203,79.3,40,2010,46,15,44,0,null,null,null,null,null,null,null,null,null,null,null,null,null,null,null,null,null,null,null,null,null,null,null,null,null,null,null,null,null,null,null,null,null,null,null,null,null,null,null,null,null,null,null,null,null,null,null,null,null,null,null,null,0,0,0,0,null,999,null,0]
[204,87.4,80,2010,46,37,54,0,null,null,null,null,null,null,null,null,null,null,null,null,null,null,null,null,null,null,null,null,null,null,null,null,null,null,null,null,null,null,null,null,null,null,null,null,null,null,null,null,null,null,null,null,null,null,null,null,null,null,null,null,83.4,145.94999999999999,0,81,null,145.94999999999999,null,0]
[205,96.3,120,2010,46,57,57,0,null,null,null,null,null,null,null,null,null,null,null,null,null,null,null,null,null,null,null,null,null,null,null,null,null,null,null,null,null,null,null,null,null,null,null,null,null,null,null,null,null,null,null,null,null,null,null,null,null,null,null,null,89.4,156.44999999999999,30,81,null,156.44999999999999,null,27.915272701507075]
[206,100,160,2010,46,71,64,0,null,null,null,null,null,null,null,null,null,null,null,null,null,null,null,null,null,null,null,null,null,null,null,null,null,null,null,null,null,null,null,null,null,null,null,null,null,null,null,null,null,null,null,null,null,null,null,null,null,null,null,null,95.4,166.95,60,87,null,166.95,null,55.830545403014149]
[207,100,0,2010,47,2,113,0,null,null,null,null,null,null,null,null,null,null,null,null,null,null,null,null,null,null,null,null,null,null,null,null,null,null,null,null,null,null,null,null,null,null,null,null,null,null,null,null,null,null,null,null,null,null,null,null,null,null,null,null,89.4,156.44999999999999,90,100,null,156.44999999999999,null,83.74581810452122]
[208,96.3,40,2010,47,16,120,0,null,null,null,null,null,null,null,null,null,null,null,null,null,null,null,null,null,null,null,null,null,null,null,null,null,null,null,null,null,null,null,null,null,null,null,null,null,null,null,null,null,null,null,null,null,null,null,null,null,null,null,null,100,175,120,105,null,175,null,111.6610908060283]
[209,100,120,2010,47,58,143,0,null,null,null,null,null,null,null,null,null,null,null,null,null,null,null,null,null,null,null,null,null,null,null,null,null,null,null,null,null,null,null,null,null,null,null,null,null,null,null,null,null,null,null,null,null,null,null,null,null,null,null,null,89.4,156.44999999999999,0,78,null,156.44999999999999,null,0]
[210,100,160,2010,47,72,164,0,null,null,null,null,null,null,null,null,null,null,null,null,null,null,null,null,null,null,null,null,null,null,null,null,null,null,null,null,null,null,null,null,null,null,null,null,null,null,null,null,null,null,null,null,null,null,null,null,null,null,null,null,94.7,165.72499999999999,30,83,null,165.72499999999999,null,27.915272701507075]
[211,94.3,0,2010,48,3,91,0,null,null,null,null,null,null,null,null,null,null,null,null,null,null,null,null,null,null,null,null,null,null,null,null,null,null,null,null,null,null,null,null,null,null,null,null,null,null,null,null,null,null,null,null,null,null,null,null,null,null,null,null,95.3,166.77500000000001,60,87,null,166.77500000000001,null,55.830545403014149]
[212,95.4,50,2010,48,25,91,0,null,null,null,null,null,null,null,null,null,null,null,null,null,null,null,null,null,null,null,null,null,null,null,null,null,null,null,null,null,null,null,null,null,null,null,null,null,null,null,null,null,null,null,null,null,null,null,null,null,null,null,null,100,175,90,112,null,175,null,83.74581810452122]
[213,97.1,100,2010,48,55,91,0,null,null,null,null,null,null,null,null,null,null,null,null,null,null,null,null,null,null,null,null,null,null,null,null,null,null,null,null,null,null,null,null,null,null,null,null,null,null,null,null,null,null,null,null,null,null,null,null,null,null,null,null,100,175,120,115,null,175,null,111.6610908060283]
[214,100,150,2010,48,69,91,0,null,null,null,null,null,null,null,null,null,null,null,null,null,null,null,null,null,null,null,null,null,null,null,null,null,null,null,null,null,null,null,null,null,null,null,null,null,null,null,null,null,null,null,null,null,null,null,null,null,null,null,null,75.599999999999994,132.30000000000001,0,94,null,132.30000000000001,null,0]
[215,95.4,0,2011,49,1,104,0,null,null,null,null,null,null,null,null,null,null,null,null,null,null,null,null,null,null,null,null,null,null,null,null,null,null,null,null,null,null,null,null,null,null,null,null,null,null,null,null,null,null,null,null,null,null,null,null,null,null,null,null,90.3,158.02500000000001,40,94,null,158.02500000000001,null,37.220363602009435]
[216,100,40,2011,49,15,130,0,null,null,null,null,null,null,null,null,null,null,null,null,null,null,null,null,null,null,null,null,null,null,null,null,null,null,null,null,null,null,null,null,null,null,null,null,null,null,null,null,null,null,null,null,null,null,null,null,null,null,null,null,90.9,159.07499999999999,80,94,null,159.07499999999999,null,74.44072720401887]
[217,98.1,80,2011,49,37,153,0,null,null,null,null,null,null,null,null,null,null,null,null,null,null,null,null,null,null,null,null,null,null,null,null,null,null,null,null,null,null,null,null,null,null,null,null,null,null,null,null,null,null,null,null,null,null,null,null,null,null,null,null,92.6,162.05000000000001,120,94,null,162.05000000000001,null,111.6610908060283]
[218,97.3,120,2011,49,57,177,0,null,null,null,null,null,null,null,null,null,null,null,null,null,null,null,null,null,null,null,null,null,null,null,null,null,null,null,null,null,null,null,null,null,null,null,null,null,null,null,null,null,null,null,null,null,null,null,null,null,null,null,null,100,175,160,94,null,175,null,148.88145440803774]
[219,94.6,160,2011,49,71,223,0,null,null,null,null,null,null,null,null,null,null,null,null,null,null,null,null,null,null,null,null,null,null,null,null,null,null,null,null,null,null,null,null,null,null,null,null,null,null,null,null,null,null,null,null,null,null,null,null,null,null,null,null,0,0,0,0,null,999,null,0]
[220,94.1,0,2010,50,4,87,0,null,null,null,null,null,null,null,null,null,null,null,null,null,null,null,null,null,null,null,null,null,null,null,null,null,null,null,null,null,null,null,null,null,null,null,null,null,null,null,null,null,null,null,null,null,null,null,null,null,null,null,null,0,0,0,0,null,999,null,0]
[221,91.9,40,2010,50,17,102,0,null,null,null,null,null,null,null,null,null,null,null,null,null,null,null,null,null,null,null,null,null,null,null,null,null,null,null,null,null,null,null,null,null,null,null,null,null,null,null,null,null,null,null,null,null,null,null,null,null,null,null,null,0,0,0,0,null,999,null,0]
[222,100,80,2010,50,38,111,0,null,null,null,null,null,null,null,null,null,null,null,null,null,null,null,null,null,null,null,null,null,null,null,null,null,null,null,null,null,null,null,null,null,null,null,null,null,null,null,null,null,null,null,null,null,null,null,null,null,null,null,null,0,0,0,0,null,999,null,0]
[223,93.9,120,2010,50,59,130,0,null,null,null,null,null,null,null,null,null,null,null,null,null,null,null,null,null,null,null,null,null,null,null,null,null,null,null,null,null,null,null,null,null,null,null,null,null,null,null,null,null,null,null,null,null,null,null,null,null,null,null,null,0,0,0,0,null,999,null,0]
[224,93,160,2010,50,73,138,0,null,null,null,null,null,null,null,null,null,null,null,null,null,null,null,null,null,null,null,null,null,null,null,null,null,null,null,null,null,null,null,null,null,null,null,null,null,null,null,null,null,null,null,null,null,null,null,null,null,null,null,null,86.6,151.55000000000001,0,81,null,151.55000000000001,null,0]
[225,95.2,0,2013,51,1,82,0,null,null,null,null,null,null,null,null,null,null,null,null,null,null,null,null,null,null,null,null,null,null,null,null,null,null,null,null,null,null,null,null,null,null,null,null,null,null,null,null,null,null,null,null,null,null,null,null,null,null,null,null,96.8,169.4,40,81,null,169.4,null,37.220363602009435]
[226,100,40,2013,51,15,100,0,null,null,null,null,null,null,null,null,null,null,null,null,null,null,null,null,null,null,null,null,null,null,null,null,null,null,null,null,null,null,null,null,null,null,null,null,null,null,null,null,null,null,null,null,null,null,null,null,null,null,null,null,100,175,80,81,null,175,null,74.44072720401887]
[227,99.4,80,2013,51,37,133,0,null,null,null,null,null,null,null,null,null,null,null,null,null,null,null,null,null,null,null,null,null,null,null,null,null,null,null,null,null,null,null,null,null,null,null,null,null,null,null,null,null,null,null,null,null,null,null,null,null,null,null,null,95.5,167.125,120,81,null,167.125,null,111.6610908060283]
[228,95.8,120,2013,51,57,161,0,null,null,null,null,null,null,null,null,null,null,null,null,null,null,null,null,null,null,null,null,null,null,null,null,null,null,null,null,null,null,null,null,null,null,null,null,null,null,null,null,null,null,null,null,null,null,null,null,null,null,null,null,96.8,169.4,160,81,null,169.4,null,148.88145440803774]
[229,94.5,160,2013,51,71,205,0,null,null,null,null,null,null,null,null,null,null,null,null,null,null,null,null,null,null,null,null,null,null,null,null,null,null,null,null,null,null,null,null,null,null,null,null,null,null,null,null,null,null,null,null,null,null,null,null,null,null,null,null,93.6,163.80000000000001,0,94,null,163.80000000000001,null,0]
[230,94.2,0,2014,52,1,80,0,null,null,null,null,null,null,null,null,null,null,null,null,null,null,null,null,null,null,null,null,null,null,null,null,null,null,null,null,null,null,null,null,null,null,null,null,null,null,null,null,null,null,null,null,null,null,null,null,null,null,null,null,95.5,167.125,40,94,null,167.125,null,37.220363602009435]
[231,98,40,2014,52,15,103,0,null,null,null,null,null,null,null,null,null,null,null,null,null,null,null,null,null,null,null,null,null,null,null,null,null,null,null,null,null,null,null,null,null,null,null,null,null,null,null,null,null,null,null,null,null,null,null,null,null,null,null,null,97,169.75,80,94,null,169.75,null,74.44072720401887]
[232,100,80,2014,52,37,129,0,null,null,null,null,null,null,null,null,null,null,null,null,null,null,null,null,null,null,null,null,null,null,null,null,null,null,null,null,null,null,null,null,null,null,null,null,null,null,null,null,null,null,null,null,null,null,null,null,null,null,null,null,100,175,120,94,null,175,null,111.6610908060283]
[233,99.3,120,2014,52,57,181,0,null,null,null,null,null,null,null,null,null,null,null,null,null,null,null,null,null,null,null,null,null,null,null,null,null,null,null,null,null,null,null,null,null,null,null,null,null,null,null,null,null,null,null,null,null,null,null,null,null,null,null,null,97.5,170.625,160,94,null,170.625,null,148.88145440803774]
[234,99.5,160,2014,52,71,215,0,null,null,null,null,null,null,null,null,null,null,null,null,null,null,null,null,null,null,null,null,null,null,null,null,null,null,null,null,null,null,null,null,null,null,null,null,null,null,null,null,null,null,null,null,null,null,null,null,null,null,null,null,0,0,0,0,null,999,null,0]
[235,99.3,0,2015,53,1,84,0,null,null,null,null,null,null,null,null,null,null,null,null,null,null,null,null,null,null,null,null,null,null,null,null,null,null,null,null,null,null,null,null,null,null,null,null,null,null,null,null,null,null,null,null,null,null,null,null,null,null,null,null,0,0,0,0,null,999,null,0]
[236,100,40,2015,53,15,109,0,null,null,null,null,null,null,null,null,null,null,null,null,null,null,null,null,null,null,null,null,null,null,null,null,null,null,null,null,null,null,null,null,null,null,null,null,null,null,null,null,null,null,null,null,null,null,null,null,null,null,null,null,0,0,0,0,null,999,null,0]
[237,96.9,80,2015,53,37,126,0,null,null,null,null,null,null,null,null,null,null,null,null,null,null,null,null,null,null,null,null,null,null,null,null,null,null,null,null,null,null,null,null,null,null,null,null,null,null,null,null,null,null,null,null,null,null,null,null,null,null,null,null,0,0,0,0,null,999,null,0]
[238,97.4,120,2015,53,57,144,0,null,null,null,null,null,null,null,null,null,null,null,null,null,null,null,null,null,null,null,null,null,null,null,null,null,null,null,null,null,null,null,null,null,null,null,null,null,null,null,null,null,null,null,null,null,null,null,null,null,null,null,null,0,0,0,0,null,999,null,0]
[239,99,160,2015,53,71,180,0,null,null,null,null,null,null,null,null,null,null,null,null,null,null,null,null,null,null,null,null,null,null,null,null,null,null,null,null,null,null,null,null,null,null,null,null,null,null,null,null,null,null,null,null,null,null,null,null,null,null,null,null,{"$f":"_xlfn.NUMBERVALUE(IF(AND($G67>=($U$151-$Y$151),$G67<=($U$151+$Y$151)),B67,\"\"))","v":0},{"$f":"_xlfn.NUMBERVALUE(IFERROR(+BI240*$W$149,\"\"))","v":0},{"$f":"_xlfn.NUMBERVALUE(IF(AND($G67>=($U$151-$Y$151),$G67<=($U$151+$Y$151)),C67,\"\"))","v":0},{"$f":"_xlfn.NUMBERVALUE(IF(AND($G67>=($U$151-$Y$151),$G67<=($U$151+$Y$151)),G67,\"\"))","v":0},null,{"$f":"IF(BJ240=0,999,BJ240)","v":999},null,{"$f":"+BK240*$BP$172","v":0}]
[240,99.4,0,2016,54,1,83,0,null,null,null,null,null,null,null,null,null,null,null,null,null,null,null,null,null,null,null,null,null,null,null,null,null,null,null,null,null,null,null,null,null,null,null,null,null,null,null,null,null,null,null,null,null,null,null,null,null,null,null,null,0,0,0,0,null,999,null,0]
[241,100,40,2016,54,15,98,0,null,null,null,null,null,null,null,null,null,null,null,null,null,null,null,null,null,null,null,null,null,null,null,null,null,null,null,null,null,null,null,null,null,null,null,null,null,null,null,null,null,null,null,null,null,null,null,null,null,null,null,null,0,0,0,0,null,999,null,0]
[242,97.1,80,2016,54,37,114,0,null,null,null,null,null,null,null,null,null,null,null,null,null,null,null,null,null,null,null,null,null,null,null,null,null,null,null,null,null,null,null,null,null,null,null,null,null,null,null,null,null,null,null,null,null,null,null,null,null,null,null,null,0,0,0,0,null,999,null,0]
[243,99.9,120,2016,54,57,129,0,null,null,null,null,null,null,null,null,null,null,null,null,null,null,null,null,null,null,null,null,null,null,null,null,null,null,null,null,null,null,null,null,null,null,null,null,null,null,null,null,null,null,null,null,null,null,null,null,null,null,null,null,0,0,0,0,null,999,null,0]
[244,99.8,160,2016,54,71,173,0,null,null,null,null,null,null,null,null,null,null,null,null,null,null,null,null,null,null,null,null,null,null,null,null,null,null,null,null,null,null,null,null,null,null,null,null,null,null,null,null,null,null,null,null,null,null,null,null,null,null,null,null,0,0,0,0,null,999,null,0]
[245,99.7,0,2017,55,1,75,0,null,null,null,null,null,null,null,null,null,null,null,null,null,null,null,null,null,null,null,null,null,null,null,null,null,null,null,null,null,null,null,null,null,null,null,null,null,null,null,null,null,null,null,null,null,null,null,null,null,null,null,null,0,0,0,0,null,999,null,0]
[246,98.1,40,2017,55,15,86,0,null,null,null,null,null,null,null,null,null,null,null,null,null,null,null,null,null,null,null,null,null,null,null,null,null,null,null,null,null,null,null,null,null,null,null,null,null,null,null,null,null,null,null,null,null,null,null,null,null,null,null,null,0,0,0,0,null,999,null,0]
[247,99.7,80,2017,55,37,98,0,null,null,null,null,null,null,null,null,null,null,null,null,null,null,null,null,null,null,null,null,null,null,null,null,null,null,null,null,null,null,null,null,null,null,null,null,null,null,null,null,null,null,null,null,null,null,null,null,null,null,null,null,100,175,120,93,null,175,null,111.6610908060283]
[248,100,120,2017,55,57,115,0,null,null,null,null,null,null,null,null,null,null,null,null,null,null,null,null,null,null,null,null,null,null,null,null,null,null,null,null,null,null,null,null,null,null,null,null,null,null,null,null,null,null,null,null,null,null,null,null,null,null,null,null,78.5,137.375,0,77,null,137.375,null,0]
[249,99.4,160,2017,55,71,154,0,null,null,null,null,null,null,null,null,null,null,null,null,null,null,null,null,null,null,null,null,null,null,null,null,null,null,null,null,null,null,null,null,null,null,null,null,null,null,null,null,null,null,null,null,null,null,null,null,null,null,null,null,85.9,150.32499999999999,30,77,null,150.32499999999999,null,27.915272701507075]
[250,84.6,0,2011,56,2,49,0,null,null,null,null,null,null,null,null,null,null,null,null,null,null,null,null,null,null,null,null,null,null,null,null,null,null,null,null,null,null,null,null,null,null,null,null,null,null,null,null,null,null,null,null,null,null,null,null,null,null,null,null,0,0,0,0,null,999,null,0]
[251,94.1,40,2011,56,16,57,0,null,null,null,null,null,null,null,null,null,null,null,null,null,null,null,null,null,null,null,null,null,null,null,null,null,null,null,null,null,null,null,null,null,null,null,null,null,null,null,null,null,null,null,null,null,null,null,null,null,null,null,null,0,0,0,0,null,999,null,0]
[252,98,80,2011,56,38,66,0,null,null,null,null,null,null,null,null,null,null,null,null,null,null,null,null,null,null,null,null,null,null,null,null,null,null,null,null,null,null,null,null,null,null,null,null,null,null,null,null,null,null,null,null,null,null,null,null,null,null,null,null,100,175,120,80,null,175,null,111.6610908060283]
[253,97.8,120,2011,56,58,78,0,null,null,null,null,null,null,null,null,null,null,null,null,null,null,null,null,null,null,null,null,null,null,null,null,null,null,null,null,null,null,null,null,null,null,null,null,null,null,null,null,null,null,null,null,null,null,null,null,null,null,null,null,0,0,0,0,null,999,null,0]
[254,100,160,2011,56,72,94,0,null,null,null,null,null,null,null,null,null,null,null,null,null,null,null,null,null,null,null,null,null,null,null,null,null,null,null,null,null,null,null,null,null,null,null,null,null,null,null,null,null,null,null,null,null,null,null,null,null,null,null,null,0,0,0,0,null,999,null,0]
[255,83.8,0,2012,57,1,49,0,null,null,null,null,null,null,null,null,null,null,null,null,null,null,null,null,null,null,null,null,null,null,null,null,null,null,null,null,null,null,null,null,null,null,null,null,null,null,null,null,null,null,null,null,null,null,null,null,null,null,null,null,0,0,0,0,null,999,null,0]
[256,92.9,40,2012,57,15,58,0,null,null,null,null,null,null,null,null,null,null,null,null,null,null,null,null,null,null,null,null,null,null,null,null,null,null,null,null,null,null,null,null,null,null,null,null,null,null,null,null,null,null,null,null,null,null,null,null,null,null,null,null,0,0,0,0,null,999,null,0]
[257,96.8,80,2012,57,37,63,0,null,null,null,null,null,null,null,null,null,null,null,null,null,null,null,null,null,null,null,null,null,null,null,null,null,null,null,null,null,null,null,null,null,null,null,null,null,null,null,null,null,null,null,null,null,null,null,null,null,null,null,null,0,0,0,0,null,999,null,0]
[258,99.9,120,2012,57,57,79,0,null,null,null,null,null,null,null,null,null,null,null,null,null,null,null,null,null,null,null,null,null,null,null,null,null,null,null,null,null,null,null,null,null,null,null,null,null,null,null,null,null,null,null,null,null,null,null,null,null,null,null,null,0,0,0,0,null,999,null,0]
[259,100,160,2012,57,73,89,0,null,null,null,null,null,null,null,null,null,null,null,null,null,null,null,null,null,null,null,null,null,null,null,null,null,null,null,null,null,null,null,null,null,null,null,null,null,null,null,null,null,null,null,null,null,null,null,null,null,null,null,null,94.3,165.02500000000001,40,76,null,165.02500000000001,null,37.220363602009435]
[260,87.2,0,2013,58,2,60,0,null,null,null,null,null,null,null,null,null,null,null,null,null,null,null,null,null,null,null,null,null,null,null,null,null,null,null,null,null,null,null,null,null,null,null,null,null,null,null,null,null,null,null,null,null,null,null,null,null,null,null,null,94.9,166.07499999999999,80,85,null,166.07499999999999,null,74.44072720401887]
[261,92.5,40,2013,58,16,64,0,null,null,null,null,null,null,null,null,null,null,null,null,null,null,null,null,null,null,null,null,null,null,null,null,null,null,null,null,null,null,null,null,null,null,null,null,null,null,null,null,null,null,null,null,null,null,null,null,null,null,null,null,95.5,167.125,120,98,null,167.125,null,111.6610908060283]
[262,95.5,80,2013,58,38,69,0,null,null,null,null,null,null,null,null,null,null,null,null,null,null,null,null,null,null,null,null,null,null,null,null,null,null,null,null,null,null,null,null,null,null,null,null,null,null,null,null,null,null,null,null,null,null,null,null,null,null,null,null,100,175,160,100,null,175,null,148.88145440803774]
[263,97.4,120,2013,58,58,79,0,null,null,null,null,null,null,null,null,null,null,null,null,null,null,null,null,null,null,null,null,null,null,null,null,null,null,null,null,null,null,null,null,null,null,null,null,null,null,null,null,null,null,null,null,null,null,null,null,null,null,null,null,0,0,0,0,null,999,null,0]
[264,100,160,2013,58,72,101,0,null,null,null,null,null,null,null,null,null,null,null,null,null,null,null,null,null,null,null,null,null,null,null,null,null,null,null,null,null,null,null,null,null,null,null,null,null,null,null,null,null,null,null,null,null,null,null,null,null,null,null,null,0,0,0,0,null,999,null,0]
[265,67.2,0,2014,59,2,43,0,null,null,null,null,null,null,null,null,null,null,null,null,null,null,null,null,null,null,null,null,null,null,null,null,null,null,null,null,null,null,null,null,null,null,null,null,null,null,null,null,null,null,null,null,null,null,null,null,null,null,null,null,0,0,0,0,null,999,null,0]
[266,88.7,40,2014,59,16,52,0,null,null,null,null,null,null,null,null,null,null,null,null,null,null,null,null,null,null,null,null,null,null,null,null,null,null,null,null,null,null,null,null,null,null,null,null,null,null,null,null,null,null,null,null,null,null,null,null,null,null,null,null,0,0,0,0,null,999,null,0]
[267,91.5,80,2014,59,38,67,0,null,null,null,null,null,null,null,null,null,null,null,null,null,null,null,null,null,null,null,null,null,null,null,null,null,null,null,null,null,null,null,null,null,null,null,null,null,null,null,null,null,null,null,null,null,null,null,null,null,null,null,null,0,0,0,0,null,999,null,0]
[268,99.3,120,2014,59,58,84,0,null,null,null,null,null,null,null,null,null,null,null,null,null,null,null,null,null,null,null,null,null,null,null,null,null,null,null,null,null,null,null,null,null,null,null,null,null,null,null,null,null,null,null,null,null,null,null,null,null,null,null,null,99.4,173.95,0,104,null,173.95,null,0]
[269,100,160,2014,59,72,93,0,null,null,null,null,null,null,null,null,null,null,null,null,null,null,null,null,null,null,null,null,null,null,null,null,null,null,null,null,null,null,null,null,null,null,null,null,null,null,null,null,null,null,null,null,null,null,null,null,null,null,null,null,100,175,40,104,null,175,null,37.220363602009435]
[270,77.5,0,2015,60,2,39,0,null,null,null,null,null,null,null,null,null,null,null,null,null,null,null,null,null,null,null,null,null,null,null,null,null,null,null,null,null,null,null,null,null,null,null,null,null,null,null,null,null,null,null,null,null,null,null,null,null,null,null,null,97.4,170.45,80,104,null,170.45,null,74.44072720401887]
[271,90.2,40,2015,60,16,53,0,null,null,null,null,null,null,null,null,null,null,null,null,null,null,null,null,null,null,null,null,null,null,null,null,null,null,null,null,null,null,null,null,null,null,null,null,null,null,null,null,null,null,null,null,null,null,null,null,null,null,null,null,98.7,172.72499999999999,120,104,null,172.72499999999999,null,111.6610908060283]
[272,95.5,80,2015,60,38,65,0,null,null,null,null,null,null,null,null,null,null,null,null,null,null,null,null,null,null,null,null,null,null,null,null,null,null,null,null,null,null,null,null,null,null,null,null,null,null,null,null,null,null,null,null,null,null,null,null,null,null,null,null,98.7,172.72499999999999,160,104,null,172.72499999999999,null,148.88145440803774]
[273,97.5,120,2015,60,58,76,0,null,null,null,null,null,null,null,null,null,null,null,null,null,null,null,null,null,null,null,null,null,null,null,null,null,null,null,null,null,null,null,null,null,null,null,null,null,null,null,null,null,null,null,null,null,null,null,null,null,null,null,null,0,0,0,0,null,999,null,0]
[274,100,160,2015,60,72,92,0,null,null,null,null,null,null,null,null,null,null,null,null,null,null,null,null,null,null,null,null,null,null,null,null,null,null,null,null,null,null,null,null,null,null,null,null,null,null,null,null,null,null,null,null,null,null,null,null,null,null,null,null,0,0,0,0,null,999,null,0]
[275,78.5,0,2016,61,2,41,0,null,null,null,null,null,null,null,null,null,null,null,null,null,null,null,null,null,null,null,null,null,null,null,null,null,null,null,null,null,null,null,null,null,null,null,null,null,null,null,null,null,null,null,null,null,null,null,null,null,null,null,null,0,0,0,0,null,999,null,0]
[276,92,40,2016,61,16,46,0,null,null,null,null,null,null,null,null,null,null,null,null,null,null,null,null,null,null,null,null,null,null,null,null,null,null,null,null,null,null,null,null,null,null,null,null,null,null,null,null,null,null,null,null,null,null,null,null,null,null,null,null,0,0,0,0,null,999,null,0]
[277,96.9,80,2016,61,38,53,0,null,null,null,null,null,null,null,null,null,null,null,null,null,null,null,null,null,null,null,null,null,null,null,null,null,null,null,null,null,null,null,null,null,null,null,null,null,null,null,null,null,null,null,null,null,null,null,null,null,null,null,null,0,0,0,0,null,999,null,0]
[278,98.2,120,2016,61,58,71,0,null,null,null,null,null,null,null,null,null,null,null,null,null,null,null,null,null,null,null,null,null,null,null,null,null,null,null,null,null,null,null,null,null,null,null,null,null,null,null,null,null,null,null,null,null,null,null,null,null,null,null,null,0,0,0,0,null,999,null,0]
[279,100,160,2016,61,72,81,0,null,null,null,null,null,null,null,null,null,null,null,null,null,null,null,null,null,null,null,null,null,null,null,null,null,null,null,null,null,null,null,null,null,null,null,null,null,null,null,null,null,null,null,null,null,null,null,null,null,null,null,null,0,0,0,0,null,999,null,0]
[280,85.6,0,2017,62,2,42,0,null,null,null,null,null,null,null,null,null,null,null,null,null,null,null,null,null,null,null,null,null,null,null,null,null,null,null,null,null,null,null,null,null,null,null,null,null,null,null,null,null,null,null,null,null,null,null,null,null,null,null,null,0,0,0,0,null,999,null,0]
[281,94.1,40,2017,62,16,49,0,null,null,null,null,null,null,null,null,null,null,null,null,null,null,null,null,null,null,null,null,null,null,null,null,null,null,null,null,null,null,null,null,null,null,null,null,null,null,null,null,null,null,null,null,null,null,null,null,null,null,null,null,96.5,168.875,0,92,null,168.875,null,0]
[282,97.2,80,2017,62,38,58,0,null,null,null,null,null,null,null,null,null,null,null,null,null,null,null,null,null,null,null,null,null,null,null,null,null,null,null,null,null,null,null,null,null,null,null,null,null,null,null,null,null,null,null,null,null,null,null,null,null,null,null,null,96.5,168.875,40,92,null,168.875,null,37.220363602009435]
[283,97.2,120,2017,62,58,68,0,null,null,null,null,null,null,null,null,null,null,null,null,null,null,null,null,null,null,null,null,null,null,null,null,null,null,null,null,null,null,null,null,null,null,null,null,null,null,null,null,null,null,null,null,null,null,null,null,null,null,null,null,100,175,80,92,null,175,null,74.44072720401887]
[284,100,160,2017,62,72,76,0,null,null,null,null,null,null,null,null,null,null,null,null,null,null,null,null,null,null,null,null,null,null,null,null,null,null,null,null,null,null,null,null,null,null,null,null,null,null,null,null,null,null,null,null,null,null,null,null,null,null,null,null,97.8,171.15,120,92,null,171.15,null,111.6610908060283]
[285,97,0,2012,63,2,76,0,null,null,null,null,null,null,null,null,null,null,null,null,null,null,null,null,null,null,null,null,null,null,null,null,null,null,null,null,null,null,null,null,null,null,null,null,null,null,null,null,null,null,null,null,null,null,null,null,null,null,null,null,98.7,172.72499999999999,160,92,null,172.72499999999999,null,148.88145440803774]
[286,96.3,50,2012,63,25,76,0,null,null,null,null,null,null,null,null,null,null,null,null,null,null,null,null,null,null,null,null,null,null,null,null,null,null,null,null,null,null,null,null,null,null,null,null,null,null,null,null,null,null,null,null,null,null,null,null,null,null,null,null,93.7,163.97499999999999,0,104,null,163.97499999999999,null,0]
[287,100,100,2012,63,55,76,0,null,null,null,null,null,null,null,null,null,null,null,null,null,null,null,null,null,null,null,null,null,null,null,null,null,null,null,null,null,null,null,null,null,null,null,null,null,null,null,null,null,null,null,null,null,null,null,null,null,null,null,null,100,175,40,104,null,175,null,37.220363602009435]
[288,98.3,150,2012,63,69,76,0,null,null,null,null,null,null,null,null,null,null,null,null,null,null,null,null,null,null,null,null,null,null,null,null,null,null,null,null,null,null,null,null,null,null,null,null,null,null,null,null,null,null,null,null,null,null,null,null,null,null,null,null,98.9,173.07499999999999,80,104,null,173.07499999999999,null,74.44072720401887]
[289,91.9,0,2015,64,3,41,0,null,null,null,null,null,null,null,null,null,null,null,null,null,null,null,null,null,null,null,null,null,null,null,null,null,null,null,null,null,null,null,null,null,null,null,null,null,null,null,null,null,null,null,null,null,null,null,null,null,null,null,null,100,175,120,104,null,175,null,111.6610908060283]
[290,94.5,40,2015,64,17,41,0,null,null,null,null,null,null,null,null,null,null,null,null,null,null,null,null,null,null,null,null,null,null,null,null,null,null,null,null,null,null,null,null,null,null,null,null,null,null,null,null,null,null,null,null,null,null,null,null,null,null,null,null,97.4,170.45,160,104,null,170.45,null,148.88145440803774]
[291,96,80,2015,64,39,41,0,null,null,null,null,null,null,null,null,null,null,null,null,null,null,null,null,null,null,null,null,null,null,null,null,null,null,null,null,null,null,null,null,null,null,null,null,null,null,null,null,null,null,null,null,null,null,null,null,null,null,null,null,101.4,177.45,0,101,null,177.45,null,0]
[292,98.7,120,2015,64,59,41,0,null,null,null,null,null,null,null,null,null,null,null,null,null,null,null,null,null,null,null,null,null,null,null,null,null,null,null,null,null,null,null,null,null,null,null,null,null,null,null,null,null,null,null,null,null,null,null,null,null,null,null,null,99.5,174.125,40,101,null,174.125,null,37.220363602009435]
[293,100,160,2015,64,73,41,0,null,null,null,null,null,null,null,null,null,null,null,null,null,null,null,null,null,null,null,null,null,null,null,null,null,null,null,null,null,null,null,null,null,null,null,null,null,null,null,null,null,null,null,null,null,null,null,null,null,null,null,null,95.2,166.6,80,101,null,166.6,null,74.44072720401887]
[294,99.1,0,2016,65,3,123,0,null,null,null,null,null,null,null,null,null,null,null,null,null,null,null,null,null,null,null,null,null,null,null,null,null,null,null,null,null,null,null,null,null,null,null,null,null,null,null,null,null,null,null,null,null,null,null,null,null,null,null,null,98.1,171.67500000000001,120,101,null,171.67500000000001,null,111.6610908060283]
[295,98.1,40,2016,65,17,123,0,null,null,null,null,null,null,null,null,null,null,null,null,null,null,null,null,null,null,null,null,null,null,null,null,null,null,null,null,null,null,null,null,null,null,null,null,null,null,null,null,null,null,null,null,null,null,null,null,null,null,null,null,100,175,160,101,null,175,null,148.88145440803774]
[296,100,80,2016,65,39,123,0,null,null,null,null,null,null,null,null,null,null,null,null,null,null,null,null,null,null,null,null,null,null,null,null,null,null,null,null,null,null,null,null,null,null,null,null,null,null,null,null,null,null,null,null,null,null,null,null,null,null,null,null,0,0,0,0,null,999,null,0]
[297,97.4,120,2016,65,59,123,0,null,null,null,null,null,null,null,null,null,null,null,null,null,null,null,null,null,null,null,null,null,null,null,null,null,null,null,null,null,null,null,null,null,null,null,null,null,null,null,null,null,null,null,null,null,null,null,null,null,null,null,null,0,0,0,0,null,999,null,0]
[298,98.1,160,2016,65,73,123,0,null,null,null,null,null,null,null,null,null,null,null,null,null,null,null,null,null,null,null,null,null,null,null,null,null,null,null,null,null,null,null,null,null,null,null,null,null,null,null,null,null,null,null,null,null,null,null,null,null,null,null,null,0,0,0,0,null,999,null,0]
[299,97.4,0,2017,66,3,85,0,null,null,null,null,null,null,null,null,null,null,null,null,null,null,null,null,null,null,null,null,null,null,null,null,null,null,null,null,null,null,null,null,null,null,null,null,null,null,null,null,null,null,null,null,null,null,null,null,null,null,null,null,0,0,0,0,null,999,null,0]
[300,100,40,2017,66,17,85,0,null,null,null,null,null,null,null,null,null,null,null,null,null,null,null,null,null,null,null,null,null,null,null,null,null,null,null,null,null,null,null,null,null,null,null,null,null,null,null,null,null,null,null,null,null,null,null,null,null,null,null,null,0,0,0,0,null,999,null,0]
[301,99.5,80,2017,66,39,85,0,null,null,null,null,null,null,null,null,null,null,null,null,null,null,null,null,null,null,null,null,null,null,null,null,null,null,null,null,null,null,null,null,null,null,null,null,null,null,null,null,null,null,null,null,null,null,null,null,null,null,null,null,0,0,0,0,null,999,null,0]
[302,97.5,120,2017,66,59,85,0,null,null,null,null,null,null,null,null,null,null,null,null,null,null,null,null,null,null,null,null,null,null,null,null,null,null,null,null,null,null,null,null,null,null,null,null,null,null,null,null,null,null,null,null,null,null,null,null,null,null,null,null,0,0,0,0,null,999,null,0]
[303,99.5,160,2017,66,73,85,0,null,null,null,null,null,null,null,null,null,null,null,null,null,null,null,null,null,null,null,null,null,null,null,null,null,null,null,null,null,null,null,null,null,null,null,null,null,null,null,null,null,null,null,null,null,null,null,null,null,null,null,null,{"$f":"_xlfn.NUMBERVALUE(IF(AND($G131>=($U$151-$Y$151),$G131<=($U$151+$Y$151)),B131,\"\"))","v":0},{"$f":"_xlfn.NUMBERVALUE(IFERROR(+BI304*$W$149,\"\"))","v":0},{"$f":"_xlfn.NUMBERVALUE(IF(AND($G131>=($U$151-$Y$151),$G131<=($U$151+$Y$151)),C131,\"\"))","v":0},{"$f":"_xlfn.NUMBERVALUE(IF(AND($G131>=($U$151-$Y$151),$G131<=($U$151+$Y$151)),G131,\"\"))","v":0},null,{"$f":"IF(BJ304=0,999,BJ304)","v":999},null,{"$f":"+BK304*$BP$172","v":0}]
[304,101.7,0,2016,67,4,114,0,null,null,null,null,null,null,null,null,null,null,null,null,null,null,null,null,null,null,null,null,null,null,null,null,null,null,null,null,null,null,null,null,null,null,null,null,null,null,null,null,null,null,null,null,null,null,null,null,null,null,null,null,0,0,0,0,null,999,null,0]
[305,98.2,40,2016,67,18,114,0,null,null,null,null,null,null,null,null,null,null,null,null,null,null,null,null,null,null,null,null,null,null,null,null,null,null,null,null,null,null,null,null,null,null,null,null,null,null,null,null,null,null,null,null,null,null,null,null,null,null,null,null,0,0,0,0,null,999,null,0]
[306,100,80,2016,67,40,114,0,null,null,null,null,null,null,null,null,null,null,null,null,null,null,null,null,null,null,null,null,null,null,null,null,null,null,null,null,null,null,null,null,null,null,null,null,null,null,null,null,null,null,null,null,null,null,null,null,null,null,null,null,86.9,152.07499999999999,0,81,null,152.07499999999999,null,0]
[307,97.5,120,2016,67,60,114,0,null,null,null,null,null,null,null,null,null,null,null,null,null,null,null,null,null,null,null,null,null,null,null,null,null,null,null,null,null,null,null,null,null,null,null,null,null,null,null,null,null,null,null,null,null,null,null,null,null,null,null,null,96.2,168.35,40,81,null,168.35,null,37.220363602009435]
[308,97.5,160,2016,67,74,114,0,null,null,null,null,null,null,null,null,null,null,null,null,null,null,null,null,null,null,null,null,null,null,null,null,null,null,null,null,null,null,null,null,null,null,null,null,null,null,null,null,null,null,null,null,null,null,null,null,null,null,null,null,95.6,167.3,80,81,null,167.3,null,74.44072720401887]
[309,99.8,0,2017,69,5,107,0,null,null,null,null,null,null,null,null,null,null,null,null,null,null,null,null,null,null,null,null,null,null,null,null,null,null,null,null,null,null,null,null,null,null,null,null,null,null,null,null,null,null,null,null,null,null,null,null,null,null,null,null,100,175,120,81,null,175,null,111.6610908060283]
[310,100,40,2017,69,18,107,0,null,null,null,null,null,null,null,null,null,null,null,null,null,null,null,null,null,null,null,null,null,null,null,null,null,null,null,null,null,null,null,null,null,null,null,null,null,null,null,null,null,null,null,null,null,null,null,null,null,null,null,null,100,175,160,81,null,175,null,148.88145440803774]
[311,97.9,80,2017,69,40,107,0,null,null,null,null,null,null,null,null,null,null,null,null,null,null,null,null,null,null,null,null,null,null,null,null,null,null,null,null,null,null,null,null,null,null,null,null,null,null,null,null,null,null,null,null,null,null,null,null,null,null,null,null,0,0,0,0,null,999,null,0]
[312,100,120,2017,69,61,107,0,null,null,null,null,null,null,null,null,null,null,null,null,null,null,null,null,null,null,null,null,null,null,null,null,null,null,null,null,null,null,null,null,null,null,null,null,null,null,null,null,null,null,null,null,null,null,null,null,null,null,null,null,0,0,0,0,null,999,null,0]
[313,97.8,160,2017,69,74,107,0,null,null,null,null,null,null,null,null,null,null,null,null,null,null,null,null,null,null,null,null,null,null,null,null,null,null,null,null,null,null,null,null,null,null,null,null,null,null,null,null,null,null,null,null,null,null,null,null,null,null,null,null,96.9,169.57499999999999,80,78,null,169.57499999999999,null,74.44072720401887]
[314,92.7,0,2015,74,5,66,0,null,null,null,null,null,null,null,null,null,null,null,null,null,null,null,null,null,null,null,null,null,null,null,null,null,null,null,null,null,null,null,null,null,null,null,null,null,null,null,null,null,null,null,null,null,null,null,null,null,null,null,null,99,173.25,120,87,null,173.25,null,111.6610908060283]
[315,96.1,60,2015,74,28,66,0,null,null,null,null,null,null,null,null,null,null,null,null,null,null,null,null,null,null,null,null,null,null,null,null,null,null,null,null,null,null,null,null,null,null,null,null,null,null,null,null,null,null,null,null,null,null,null,null,null,null,null,null,0,0,0,0,null,999,null,0]
[316,100,90,2015,74,46,66,0,null,null,null,null,null,null,null,null,null,null,null,null,null,null,null,null,null,null,null,null,null,null,null,null,null,null,null,null,null,null,null,null,null,null,null,null,null,null,null,null,null,null,null,null,null,null,null,null,null,null,null,null,0,0,0,0,null,999,null,0]
[317,93,120,2015,74,61,66,0,null,null,null,null,null,null,null,null,null,null,null,null,null,null,null,null,null,null,null,null,null,null,null,null,null,null,null,null,null,null,null,null,null,null,null,null,null,null,null,null,null,null,null,null,null,null,null,null,null,null,null,null,0,0,0,0,null,999,null,0]
[318,94.2,0,2015,75,6,97,0,null,null,null,null,null,null,null,null,null,null,null,null,null,null,null,null,null,null,null,null,null,null,null,null,null,null,null,null,null,null,null,null,null,null,null,null,null,null,null,null,null,null,null,null,null,null,null,null,null,null,null,null,0,0,0,0,null,999,null,0]
[319,98.5,60,2015,75,29,97,0,null,null,null,null,null,null,null,null,null,null,null,null,null,null,null,null,null,null,null,null,null,null,null,null,null,null,null,null,null,null,null,null,null,null,null,null,null,null,null,null,null,null,null,null,null,null,null,null,null,null,null,null,0,0,0,0,null,999,null,0]
[320,98.2,90,2015,75,47,97,0,null,null,null,null,null,null,null,null,null,null,null,null,null,null,null,null,null,null,null,null,null,null,null,null,null,null,null,null,null,null,null,null,null,null,null,null,null,null,null,null,null,null,null,null,null,null,null,null,null,null,null,null,100,175,160,99,null,175,null,148.88145440803774]
[321,100,120,2015,75,62,97,0,null,null,null,null,null,null,null,null,null,null,null,null,null,null,null,null,null,null,null,null,null,null,null,null,null,null,null,null,null,null,null,null,null,null,null,null,null,null,null,null,null,null,null,null,null,null,null,null,null,null,null,null,0,0,0,0,null,999,null,0]
[322,97.3,0,2013,76,4,108,0,null,null,null,null,null,null,null,null,null,null,null,null,null,null,null,null,null,null,null,null,null,null,null,null,null,null,null,null,null,null,null,null,null,null,null,null,null,null,null,null,null,null,null,null,null,null,null,null,null,null,null,null,0,0,0,0,null,999,null,0]
[323,99.4,60,2013,76,28,108,0,null,null,null,null,null,null,null,null,null,null,null,null,null,null,null,null,null,null,null,null,null,null,null,null,null,null,null,null,null,null,null,null,null,null,null,null,null,null,null,null,null,null,null,null,null,null,null,null,null,null,null,null,0,0,0,0,null,999,null,0]
[324,99.3,90,2013,76,46,108,0,null,null,null,null,null,null,null,null,null,null,null,null,null,null,null,null,null,null,null,null,null,null,null,null,null,null,null,null,null,null,null,null,null,null,null,null,null,null,null,null,null,null,null,null,null,null,null,null,null,null,null,null,97.5,170.625,120,81,null,170.625,null,111.6610908060283]
[325,100,120,2013,76,60,108,0,null,null,null,null,null,null,null,null,null,null,null,null,null,null,null,null,null,null,null,null,null,null,null,null,null,null,null,null,null,null,null,null,null,null,null,null,null,null,null,null,null,null,null,null,null,null,null,null,null,null,null,null,100,175,160,94,null,175,null,148.88145440803774]
[326,94.5,0,2014,77,5,55,0,null,null,null,null,null,null,null,null,null,null,null,null,null,null,null,null,null,null,null,null,null,null,null,null,null,null,null,null,null,null,null,null,null,null,null,null,null,null,null,null,null,null,null,null,null,null,null,null,null,null,null,null,0,0,0,0,null,999,null,0]
[327,97.5,60,2014,77,29,55,0,null,null,null,null,null,null,null,null,null,null,null,null,null,null,null,null,null,null,null,null,null,null,null,null,null,null,null,null,null,null,null,null,null,null,null,null,null,null,null,null,null,null,null,null,null,null,null,null,null,null,null,null,0,0,0,0,null,999,null,0]
[328,92.7,90,2014,77,47,55,0,null,null,null,null,null,null,null,null,null,null,null,null,null,null,null,null,null,null,null,null,null,null,null,null,null,null,null,null,null,null,null,null,null,null,null,null,null,null,null,null,null,null,null,null,null,null,null,null,null,null,null,null,0,0,0,0,null,999,null,0]
[329,100,120,2014,77,61,55,0,null,null,null,null,null,null,null,null,null,null,null,null,null,null,null,null,null,null,null,null,null,null,null,null,null,null,null,null,null,null,null,null,null,null,null,null,null,null,null,null,null,null,null,null,null,null,null,null,null,null,null,null,0,0,0,0,null,999,null,0]
[330,92,0,2014,78,6,88,0,null,null,null,null,null,null,null,null,null,null,null,null,null,null,null,null,null,null,null,null,null,null,null,null,null,null,null,null,null,null,null,null,null,null,null,null,null,null,null,null,null,null,null,null,null,null,null,null,null,null,null,null,95.3,166.77500000000001,0,113,null,166.77500000000001,null,0]
[331,92.9,60,2014,78,30,88,0,null,null,null,null,null,null,null,null,null,null,null,null,null,null,null,null,null,null,null,null,null,null,null,null,null,null,null,null,null,null,null,null,null,null,null,null,null,null,null,null,null,null,null,null,null,null,null,null,null,null,null,null,100,175,60,113,null,175,null,55.830545403014149]
[332,92.8,90,2014,78,48,88,0,null,null,null,null,null,null,null,null,null,null,null,null,null,null,null,null,null,null,null,null,null,null,null,null,null,null,null,null,null,null,null,null,null,null,null,null,null,null,null,null,null,null,null,null,null,null,null,null,null,null,null,null,98.4,172.2,120,113,null,172.2,null,111.6610908060283]
[333,100,120,2014,78,62,88,0,null,null,null,null,null,null,null,null,null,null,null,null,null,null,null,null,null,null,null,null,null,null,null,null,null,null,null,null,null,null,null,null,null,null,null,null,null,null,null,null,null,null,null,null,null,null,null,null,null,null,null,null,97.9,171.32499999999999,180,113,null,171.32499999999999,null,167.49163620904244]
[334,95.8,0,2014,79,7,72,0,null,null,null,null,null,null,null,null,null,null,null,null,null,null,null,null,null,null,null,null,null,null,null,null,null,null,null,null,null,null,null,null,null,null,null,null,null,null,null,null,null,null,null,null,null,null,null,null,null,null,null,null,98.8,172.9,0,113,null,172.9,null,0]
[335,100,60,2014,79,31,72,0,null,null,null,null,null,null,null,null,null,null,null,null,null,null,null,null,null,null,null,null,null,null,null,null,null,null,null,null,null,null,null,null,null,null,null,null,null,null,null,null,null,null,null,null,null,null,null,null,null,null,null,null,100,175,30,113,null,175,null,27.915272701507075]
[336,97.1,90,2014,79,49,72,0,null,null,null,null,null,null,null,null,null,null,null,null,null,null,null,null,null,null,null,null,null,null,null,null,null,null,null,null,null,null,null,null,null,null,null,null,null,null,null,null,null,null,null,null,null,null,null,null,null,null,null,null,98.2,171.85,60,113,null,171.85,null,55.830545403014149]
[337,95.5,120,2014,79,63,72,0,null,null,null,null,null,null,null,null,null,null,null,null,null,null,null,null,null,null,null,null,null,null,null,null,null,null,null,null,null,null,null,null,null,null,null,null,null,null,null,null,null,null,null,null,null,null,null,null,null,null,null,null,98.2,171.85,90,113,null,171.85,null,83.74581810452122]
[338,97.9,0,2013,80,5,70,0,null,null,null,null,null,null,null,null,null,null,null,null,null,null,null,null,null,null,null,null,null,null,null,null,null,null,null,null,null,null,null,null,null,null,null,null,null,null,null,null,null,null,null,null,null,null,null,null,null,null,null,null,97.5,170.625,120,113,null,170.625,null,111.6610908060283]
[339,100,60,2013,80,29,70,0,null,null,null,null,null,null,null,null,null,null,null,null,null,null,null,null,null,null,null,null,null,null,null,null,null,null,null,null,null,null,null,null,null,null,null,null,null,null,null,null,null,null,null,null,null,null,null,null,null,null,null,null,0,0,0,0,null,999,null,0]
[340,96.9,90,2013,80,47,70,0,null,null,null,null,null,null,null,null,null,null,null,null,null,null,null,null,null,null,null,null,null,null,null,null,null,null,null,null,null,null,null,null,null,null,null,null,null,null,null,null,null,null,null,null,null,null,null,null,null,null,null,null,0,0,0,0,null,999,null,0]
[341,99.2,120,2013,80,61,70,0,null,null,null,null,null,null,null,null,null,null,null,null,null,null,null,null,null,null,null,null,null,null,null,null,null,null,null,null,null,null,null,null,null,null,null,null,null,null,null,null,null,null,null,null,null,null,null,null,null,null,null,null,0,0,0,0,null,999,null,0]
[342,93,0,2015,81,7,37,0,null,null,null,null,null,null,null,null,null,null,null,null,null,null,null,null,null,null,null,null,null,null,null,null,null,null,null,null,null,null,null,null,null,null,null,null,null,null,null,null,null,null,null,null,null,null,null,null,null,null,null,null,0,0,0,0,null,999,null,0]
[343,98.5,60,2015,81,30,37,0,null,null,null,null,null,null,null,null,null,null,null,null,null,null,null,null,null,null,null,null,null,null,null,null,null,null,null,null,null,null,null,null,null,null,null,null,null,null,null,null,null,null,null,null,null,null,null,null,null,null,null,null,0,0,0,0,null,999,null,0]
[344,97.5,90,2015,81,48,37,0,null,null,null,null,null,null,null,null,null,null,null,null,null,null,null,null,null,null,null,null,null,null,null,null,null,null,null,null,null,null,null,null,null,null,null,null,null,null,null,null,null,null,null,null,null,null,null,null,null,null,null,null,0,0,0,0,null,999,null,0]
[345,100,120,2015,81,63,37,0,null,null,null,null,null,null,null,null,null,null,null,null,null,null,null,null,null,null,null,null,null,null,null,null,null,null,null,null,null,null,null,null,null,null,null,null,null,null,null,null,null,null,null,null,null,null,null,null,null,null,null,null,0,0,0,0,null,999,null,0]
[346,99.5,0,2013,82,6,70,0,null,null,null,null,null,null,null,null,null,null,null,null,null,null,null,null,null,null,null,null,null,null,null,null,null,null,null,null,null,null,null,null,null,null,null,null,null,null,null,null,null,null,null,null,null,null,null,null,null,null,null,null,0,0,0,0,null,999,null,0]
[347,98.4,60,2013,82,30,70,0,null,null,null,null,null,null,null,null,null,null,null,null,null,null,null,null,null,null,null,null,null,null,null,null,null,null,null,null,null,null,null,null,null,null,null,null,null,null,null,null,null,null,null,null,null,null,null,null,null,null,null,null,0,0,0,0,null,999,null,0]
[348,99.2,90,2013,82,48,70,0,null,null,null,null,null,null,null,null,null,null,null,null,null,null,null,null,null,null,null,null,null,null,null,null,null,null,null,null,null,null,null,null,null,null,null,null,null,null,null,null,null,null,null,null,null,null,null,null,null,null,null,null,0,0,0,0,null,999,null,0]
[349,100,120,2013,82,62,70,0,null,null,null,null,null,null,null,null,null,null,null,null,null,null,null,null,null,null,null,null,null,null,null,null,null,null,null,null,null,null,null,null,null,null,null,null,null,null,null,null,null,null,null,null,null,null,null,null,null,null,null,null,81.599999999999994,142.80000000000001,0,104,null,142.80000000000001,null,0]
[350,98.2,0,2014,83,8,90,0,null,null,null,null,null,null,null,null,null,null,null,null,null,null,null,null,null,null,null,null,null,null,null,null,null,null,null,null,null,null,null,null,null,null,null,null,null,null,null,null,null,null,null,null,null,null,null,null,null,null,null,null,95.3,166.77500000000001,60,104,null,166.77500000000001,null,55.830545403014149]
[351,100,60,2014,83,32,90,0,null,null,null,null,null,null,null,null,null,null,null,null,null,null,null,null,null,null,null,null,null,null,null,null,null,null,null,null,null,null,null,null,null,null,null,null,null,null,null,null,null,null,null,null,null,null,null,null,null,null,null,null,100,175,120,104,null,175,null,111.6610908060283]
[352,96.3,90,2014,83,50,90,0,null,null,null,null,null,null,null,null,null,null,null,null,null,null,null,null,null,null,null,null,null,null,null,null,null,null,null,null,null,null,null,null,null,null,null,null,null,null,null,null,null,null,null,null,null,null,null,null,null,null,null,null,94.3,165.02500000000001,0,103,null,165.02500000000001,null,0]
[353,99,120,2014,83,64,90,0,null,null,null,null,null,null,null,null,null,null,null,null,null,null,null,null,null,null,null,null,null,null,null,null,null,null,null,null,null,null,null,null,null,null,null,null,null,null,null,null,null,null,null,null,null,null,null,null,null,null,null,null,99.5,174.125,60,103,null,174.125,null,55.830545403014149]
[354,96.1,0,2015,84,8,100,0,null,null,null,null,null,null,null,null,null,null,null,null,null,null,null,null,null,null,null,null,null,null,null,null,null,null,null,null,null,null,null,null,null,null,null,null,null,null,null,null,null,null,null,null,null,null,null,null,null,null,null,null,100,175,120,103,null,175,null,111.6610908060283]
[355,100,60,2015,84,31,100,0,null,null,null,null,null,null,null,null,null,null,null,null,null,null,null,null,null,null,null,null,null,null,null,null,null,null,null,null,null,null,null,null,null,null,null,null,null,null,null,null,null,null,null,null,null,null,null,null,null,null,null,null,91.4,159.94999999999999,0,78,null,159.94999999999999,null,0]
[356,94.7,90,2015,84,49,100,0,null,null,null,null,null,null,null,null,null,null,null,null,null,null,null,null,null,null,null,null,null,null,null,null,null,null,null,null,null,null,null,null,null,null,null,null,null,null,null,null,null,null,null,null,null,null,null,null,null,null,null,null,96.1,168.17500000000001,60,78,null,168.17500000000001,null,55.830545403014149]
[357,98.7,120,2015,84,64,100,0,null,null,null,null,null,null,null,null,null,null,null,null,null,null,null,null,null,null,null,null,null,null,null,null,null,null,null,null,null,null,null,null,null,null,null,null,null,null,null,null,null,null,null,null,null,null,null,null,null,null,null,null,100,175,120,78,null,175,null,111.6610908060283]
[358,97.4,0,2013,85,7,104,0,null,null,null,null,null,null,null,null,null,null,null,null,null,null,null,null,null,null,null,null,null,null,null,null,null,null,null,null,null,null,null,null,null,null,null,null,null,null,null,null,null,null,null,null,null,null,null,null,null,null,null,null,0,0,0,0,null,999,null,0]
[359,96.7,60,2013,85,31,104,0,null,null,null,null,null,null,null,null,null,null,null,null,null,null,null,null,null,null,null,null,null,null,null,null,null,null,null,null,null,null,null,null,null,null,null,null,null,null,null,null,null,null,null,null,null,null,null,null,null,null,null,null,0,0,0,0,null,999,null,0]
[360,98.2,90,2013,85,49,104,0,null,null,null,null,null,null,null,null,null,null,null,null,null,null,null,null,null,null,null,null,null,null,null,null,null,null,null,null,null,null,null,null,null,null,null,null,null,null,null,null,null,null,null,null,null,null,null,null,null,null,null,null,0,0,0,0,null,999,null,0]
[361,100,120,2013,85,63,104,0,null,null,null,null,null,null,null,null,null,null,null,null,null,null,null,null,null,null,null,null,null,null,null,null,null,null,null,null,null,null,null,null,null,null,null,null,null,null,null,null,null,null,null,null,null,null,null,null,null,null,null,null,0,0,0,0,null,999,null,0]
[362,99.1,0,2014,86,9,109,0,null,null,null,null,null,null,null,null,null,null,null,null,null,null,null,null,null,null,null,null,null,null,null,null,null,null,null,null,null,null,null,null,null,null,null,null,null,null,null,null,null,null,null,null,null,null,null,null,null,null,null,null,0,0,0,0,null,999,null,0]
[363,97.2,60,2014,86,33,109,0,null,null,null,null,null,null,null,null,null,null,null,null,null,null,null,null,null,null,null,null,null,null,null,null,null,null,null,null,null,null,null,null,null,null,null,null,null,null,null,null,null,null,null,null,null,null,null,null,null,null,null,null,0,0,0,0,null,999,null,0]
[364,100,90,2014,86,51,109,0,null,null,null,null,null,null,null,null,null,null,null,null,null,null,null,null,null,null,null,null,null,null,null,null,null,null,null,null,null,null,null,null,null,null,null,null,null,null,null,null,null,null,null,null,null,null,null,null,null,null,null,null,0,0,0,0,null,999,null,0]
[365,99.3,120,2014,86,65,109,0,null,null,null,null,null,null,null,null,null,null,null,null,null,null,null,null,null,null,null,null,null,null,null,null,null,null,null,null,null,null,null,null,null,null,null,null,null,null,null,null,null,null,null,null,null,null,null,null,null,null,null,null,0,0,0,0,null,999,null,0]
[366,99,0,2014,88,10,85,0,null,null,null,null,null,null,null,null,null,null,null,null,null,null,null,null,null,null,null,null,null,null,null,null,null,null,null,null,null,null,null,null,null,null,null,null,null,null,null,null,null,null,null,null,null,null,null,null,null,null,null,null,0,0,0,0,null,999,null,0]
[367,93.3,60,2014,88,34,85,0,null,null,null,null,null,null,null,null,null,null,null,null,null,null,null,null,null,null,null,null,null,null,null,null,null,null,null,null,null,null,null,null,null,null,null,null,null,null,null,null,null,null,null,null,null,null,null,null,null,null,null,null,{"$f":"_xlfn.NUMBERVALUE(IF(AND($G195>=($U$151-$Y$151),$G195<=($U$151+$Y$151)),B195,\"\"))","v":0},{"$f":"_xlfn.NUMBERVALUE(IFERROR(+BI368*$W$149,\"\"))","v":0},{"$f":"_xlfn.NUMBERVALUE(IF(AND($G195>=($U$151-$Y$151),$G195<=($U$151+$Y$151)),C195,\"\"))","v":0},{"$f":"_xlfn.NUMBERVALUE(IF(AND($G195>=($U$151-$Y$151),$G195<=($U$151+$Y$151)),G195,\"\"))","v":0},null,{"$f":"IF(BJ368=0,999,BJ368)","v":999},null,{"$f":"+BK368*$BP$172","v":0}]
[368,100,90,2014,88,52,85,0,null,null,null,null,null,null,null,null,null,null,null,null,null,null,null,null,null,null,null,null,null,null,null,null,null,null,null,null,null,null,null,null,null,null,null,null,null,null,null,null,null,null,null,null,null,null,null,null,null,null,null,null,84.1,147.17500000000001,40,79,null,147.17500000000001,null,37.220363602009435]
[369,91.9,120,2014,88,66,85,0,null,null,null,null,null,null,null,null,null,null,null,null,null,null,null,null,null,null,null,null,null,null,null,null,null,null,null,null,null,null,null,null,null,null,null,null,null,null,null,null,null,null,null,null,null,null,null,null,null,null,null,null,93.8,164.15,80,86,null,164.15,null,74.44072720401887]
[370,99.7,0,2015,89,9,120,0,null,null,null,null,null,null,null,null,null,null,null,null,null,null,null,null,null,null,null,null,null,null,null,null,null,null,null,null,null,null,null,null,null,null,null,null,null,null,null,null,null,null,null,null,null,null,null,null,null,null,null,null,92.4,161.69999999999999,120,109,null,161.69999999999999,null,111.6610908060283]
[371,100,60,2015,89,32,120,0,null,null,null,null,null,null,null,null,null,null,null,null,null,null,null,null,null,null,null,null,null,null,null,null,null,null,null,null,null,null,null,null,null,null,null,null,null,null,null,null,null,null,null,null,null,null,null,null,null,null,null,null,0,0,0,0,null,999,null,0]
[372,99.8,90,2015,89,50,120,0,null,null,null,null,null,null,null,null,null,null,null,null,null,null,null,null,null,null,null,null,null,null,null,null,null,null,null,null,null,null,null,null,null,null,null,null,null,null,null,null,null,null,null,null,null,null,null,null,null,null,null,null,93.9,164.32499999999999,0,96,null,164.32499999999999,null,0]
[373,96.8,120,2015,89,65,120,0,null,null,null,null,null,null,null,null,null,null,null,null,null,null,null,null,null,null,null,null,null,null,null,null,null,null,null,null,null,null,null,null,null,null,null,null,null,null,null,null,null,null,null,null,null,null,null,null,null,null,null,null,96.4,168.7,45,96,null,168.7,null,41.87290905226061]
[374,98.1,0,2015,91,11,117,0,null,null,null,null,null,null,null,null,null,null,null,null,null,null,null,null,null,null,null,null,null,null,null,null,null,null,null,null,null,null,null,null,null,null,null,null,null,null,null,null,null,null,null,null,null,null,null,null,null,null,null,null,100,175,90,96,null,175,null,83.74581810452122]
[375,100,60,2015,91,34,117,0,null,null,null,null,null,null,null,null,null,null,null,null,null,null,null,null,null,null,null,null,null,null,null,null,null,null,null,null,null,null,null,null,null,null,null,null,null,null,null,null,null,null,null,null,null,null,null,null,null,null,null,null,0,0,0,0,null,999,null,0]
[376,100,90,2015,91,52,117,0,null,null,null,null,null,null,null,null,null,null,null,null,null,null,null,null,null,null,null,null,null,null,null,null,null,null,null,null,null,null,null,null,null,null,null,null,null,null,null,null,null,null,null,null,null,null,null,null,null,null,null,null,0,0,0,0,null,999,null,0]
[377,98.2,120,2015,91,67,117,0,null,null,null,null,null,null,null,null,null,null,null,null,null,null,null,null,null,null,null,null,null,null,null,null,null,null,null,null,null,null,null,null,null,null,null,null,null,null,null,null,null,null,null,null,null,null,null,null,null,null,null,null,0,0,0,0,null,999,null,0]
[378,95.7,0,2014,93,12,126,0,null,null,null,null,null,null,null,null,null,null,null,null,null,null,null,null,null,null,null,null,null,null,null,null,null,null,null,null,null,null,null,null,null,null,null,null,null,null,null,null,null,null,null,null,null,null,null,null,null,null,null,null,0,0,0,0,null,999,null,0]
[379,95.8,60,2014,93,36,126,0,null,null,null,null,null,null,null,null,null,null,null,null,null,null,null,null,null,null,null,null,null,null,null,null,null,null,null,null,null,null,null,null,null,null,null,null,null,null,null,null,null,null,null,null,null,null,null,null,null,null,null,null,0,0,0,0,null,999,null,0]
[380,97.7,90,2014,93,54,126,0,null,null,null,null,null,null,null,null,null,null,null,null,null,null,null,null,null,null,null,null,null,null,null,null,null,null,null,null,null,null,null,null,null,null,null,null,null,null,null,null,null,null,null,null,null,null,null,null,null,null,null,null,100,175,0,113,null,175,null,0]
[381,100,120,2014,93,68,126,0,null,null,null,null,null,null,null,null,null,null,null,null,null,null,null,null,null,null,null,null,null,null,null,null,null,null,null,null,null,null,null,null,null,null,null,null,null,null,null,null,null,null,null,null,null,null,null,null,null,null,null,null,0,0,0,0,null,999,null,0]
[382,92.4,0,2018,95,2,69,0,null,null,null,null,null,null,null,null,null,null,null,null,null,null,null,null,null,null,null,null,null,null,null,null,null,null,null,null,null,null,null,null,null,null,null,null,null,null,null,null,null,null,null,null,null,null,null,null,null,null,null,null,0,0,0,0,null,999,null,0]
[383,97.5,40,2018,95,15,79,0,null,null,null,null,null,null,null,null,null,null,null,null,null,null,null,null,null,null,null,null,null,null,null,null,null,null,null,null,null,null,null,null,null,null,null,null,null,null,null,null,null,null,null,null,null,null,null,null,null,null,null,null,0,0,0,0,null,999,null,0]
[384,98.3,80,2018,95,37,94,0,null,null,null,null,null,null,null,null,null,null,null,null,null,null,null,null,null,null,null,null,null,null,null,null,null,null,null,null,null,null,null,null,null,null,null,null,null,null,null,null,null,null,null,null,null,null,null,null,null,null,null,null,94.3,165.02500000000001,0,91,null,165.02500000000001,null,0]
[385,100,120,2018,95,58,110,0,null,null,null,null,null,null,null,null,null,null,null,null,null,null,null,null,null,null,null,null,null,null,null,null,null,null,null,null,null,null,null,null,null,null,null,null,null,null,null,null,null,null,null,null,null,null,null,null,null,null,null,null,95.4,166.95,50,91,null,166.95,null,46.525454502511792]
[386,98.2,160,2018,95,71,133,0,null,null,null,null,null,null,null,null,null,null,null,null,null,null,null,null,null,null,null,null,null,null,null,null,null,null,null,null,null,null,null,null,null,null,null,null,null,null,null,null,null,null,null,null,null,null,null,null,null,null,null,null,97.1,169.92500000000001,100,91,null,169.92500000000001,null,93.050909005023584]
[387,75.5,0,2018,96,3,37,0,null,null,null,null,null,null,null,null,null,null,null,null,null,null,null,null,null,null,null,null,null,null,null,null,null,null,null,null,null,null,null,null,null,null,null,null,null,null,null,null,null,null,null,null,null,null,null,null,null,null,null,null,100,175,150,91,null,175,null,139.57636350753538]
[388,90.1,40,2018,96,16,50,0,null,null,null,null,null,null,null,null,null,null,null,null,null,null,null,null,null,null,null,null,null,null,null,null,null,null,null,null,null,null,null,null,null,null,null,null,null,null,null,null,null,null,null,null,null,null,null,null,null,null,null,null,95.4,166.95,0,104,null,166.95,null,0]
[389,94.8,80,2018,96,38,51,0,null,null,null,null,null,null,null,null,null,null,null,null,null,null,null,null,null,null,null,null,null,null,null,null,null,null,null,null,null,null,null,null,null,null,null,null,null,null,null,null,null,null,null,null,null,null,null,null,null,null,null,null,0,0,0,0,null,999,null,0]
[390,99.1,120,2018,96,59,70,0,null,null,null,null,null,null,null,null,null,null,null,null,null,null,null,null,null,null,null,null,null,null,null,null,null,null,null,null,null,null,null,null,null,null,null,null,null,null,null,null,null,null,null,null,null,null,null,null,null,null,null,null,0,0,0,0,null,999,null,0]
[391,100,160,2018,96,72,88,0,null,null,null,null,null,null,null,null,null,null,null,null,null,null,null,null,null,null,null,null,null,null,null,null,null,null,null,null,null,null,null,null,null,null,null,null,null,null,null,null,null,null,null,null,null,null,null,null,null,null,null,null,0,0,0,0,null,999,null,0]
[392,93.7,0,2018,97,4,115,0,null,null,null,null,null,null,null,null,null,null,null,null,null,null,null,null,null,null,null,null,null,null,null,null,null,null,null,null,null,null,null,null,null,null,null,null,null,null,null,null,null,null,null,null,null,null,null,null,null,null,null,null,0,0,0,0,null,999,null,0]
[393,97.7,40,2018,97,17,115,0,null,null,null,null,null,null,null,null,null,null,null,null,null,null,null,null,null,null,null,null,null,null,null,null,null,null,null,null,null,null,null,null,null,null,null,null,null,null,null,null,null,null,null,null,null,null,null,null,null,null,null,null,94.1,164.67500000000001,0,87,null,164.67500000000001,null,0]
[394,97.8,80,2018,97,39,115,0,null,null,null,null,null,null,null,null,null,null,null,null,null,null,null,null,null,null,null,null,null,null,null,null,null,null,null,null,null,null,null,null,null,null,null,null,null,null,null,null,null,null,null,null,null,null,null,null,null,null,null,null,91.9,160.82499999999999,40,102,null,160.82499999999999,null,37.220363602009435]
[395,94,120,2018,97,60,115,0,null,null,null,null,null,null,null,null,null,null,null,null,null,null,null,null,null,null,null,null,null,null,null,null,null,null,null,null,null,null,null,null,null,null,null,null,null,null,null,null,null,null,null,null,null,null,null,null,null,null,null,null,100,175,80,111,null,175,null,74.44072720401887]
[396,100,160,2018,97,73,115,0,null,null,null,null,null,null,null,null,null,null,null,null,null,null,null,null,null,null,null,null,null,null,null,null,null,null,null,null,null,null,null,null,null,null,null,null,null,null,null,null,null,null,null,null,null,null,null,null,null,null,null,null,0,0,0,0,null,999,null,0]
[397,82.9,0,2018,98,5,68,0,null,null,null,null,null,null,null,null,null,null,null,null,null,null,null,null,null,null,null,null,null,null,null,null,null,null,null,null,null,null,null,null,null,null,null,null,null,null,null,null,null,null,null,null,null,null,null,null,null,null,null,null,0,0,0,0,null,999,null,0]
[398,91.4,40,2018,98,18,68,0,null,null,null,null,null,null,null,null,null,null,null,null,null,null,null,null,null,null,null,null,null,null,null,null,null,null,null,null,null,null,null,null,null,null,null,null,null,null,null,null,null,null,null,null,null,null,null,null,null,null,null,null,95.2,166.6,0,82,null,166.6,null,0]
[399,94.2,80,2018,98,40,68,0,null,null,null,null,null,null,null,null,null,null,null,null,null,null,null,null,null,null,null,null,null,null,null,null,null,null,null,null,null,null,null,null,null,null,null,null,null,null,null,null,null,null,null,null,null,null,null,null,null,null,null,null,100,175,40,100,null,175,null,37.220363602009435]
[400,96,120,2018,98,61,68,0,null,null,null,null,null,null,null,null,null,null,null,null,null,null,null,null,null,null,null,null,null,null,null,null,null,null,null,null,null,null,null,null,null,null,null,null,null,null,null,null,null,null,null,null,null,null,null,null,null,null,null,null,0,0,0,0,null,999,null,0]
[401,100,160,2018,98,74,68,0,null,null,null,null,null,null,null,null,null,null,null,null,null,null,null,null,null,null,null,null,null,null,null,null,null,null,null,null,null,null,null,null,null,null,null,null,null,null,null,null,null,null,null,null,null,null,null,null,null,null,null,null,0,0,0,0,null,999,null,0]
[402,97.4,0,2018,99,6,109,0,null,null,null,null,null,null,null,null,null,null,null,null,null,null,null,null,null,null,null,null,null,null,null,null,null,null,null,null,null,null,null,null,null,null,null,null,null,null,null,null,null,null,null,null,null,null,null,null,null,null,null,null,0,0,0,0,null,999,null,0]
[403,96.2,40,2018,99,19,109,0,null,null,null,null,null,null,null,null,null,null,null,null,null,null,null,null,null,null,null,null,null,null,null,null,null,null,null,null,null,null,null,null,null,null,null,null,null,null,null,null,null,null,null,null,null,null,null,null,null,null,null,null,94.2,164.85,0,80,null,164.85,null,0]
[404,94.2,80,2018,99,41,109,0,null,null,null,null,null,null,null,null,null,null,null,null,null,null,null,null,null,null,null,null,null,null,null,null,null,null,null,null,null,null,null,null,null,null,null,null,null,null,null,null,null,null,null,null,null,null,null,null,null,null,null,null,98,171.5,40,103,null,171.5,null,37.220363602009435]
[405,95.1,120,2018,99,62,109,0,null,null,null,null,null,null,null,null,null,null,null,null,null,null,null,null,null,null,null,null,null,null,null,null,null,null,null,null,null,null,null,null,null,null,null,null,null,null,null,null,null,null,null,null,null,null,null,null,null,null,null,null,0,0,0,0,null,999,null,0]
[406,100,160,2018,99,75,109,0,null,null,null,null,null,null,null,null,null,null,null,null,null,null,null,null,null,null,null,null,null,null,null,null,null,null,null,null,null,null,null,null,null,null,null,null,null,null,null,null,null,null,null,null,null,null,null,null,null,null,null,null,0,0,0,0,null,999,null,0]
[407,98.2,0,2018,100,7,67,0,null,null,null,null,null,null,null,null,null,null,null,null,null,null,null,null,null,null,null,null,null,null,null,null,null,null,null,null,null,null,null,null,null,null,null,null,null,null,null,null,null,null,null,null,null,null,null,null,null,null,null,null,0,0,0,0,null,999,null,0]
[408,94.6,50,2018,100,25,67,0,null,null,null,null,null,null,null,null,null,null,null,null,null,null,null,null,null,null,null,null,null,null,null,null,null,null,null,null,null,null,null,null,null,null,null,null,null,null,null,null,null,null,null,null,null,null,null,null,null,null,null,null,99.3,173.77500000000001,0,84,null,173.77500000000001,null,0]
[409,100,100,2018,100,55,67,0,null,null,null,null,null,null,null,null,null,null,null,null,null,null,null,null,null,null,null,null,null,null,null,null,null,null,null,null,null,null,null,null,null,null,null,null,null,null,null,null,null,null,null,null,null,null,null,null,null,null,null,null,100,175,40,109,null,175,null,37.220363602009435]
[410,94.8,150,2018,100,69,67,0,null,null,null,null,null,null,null,null,null,null,null,null,null,null,null,null,null,null,null,null,null,null,null,null,null,null,null,null,null,null,null,null,null,null,null,null,null,null,null,null,null,null,null,null,null,null,null,null,null,null,null,null,0,0,0,0,null,999,null,0]
[411,97.5,0,2018,101,8,103,0,null,null,null,null,null,null,null,null,null,null,null,null,null,null,null,null,null,null,null,null,null,null,null,null,null,null,null,null,null,null,null,null,null,null,null,null,null,null,null,null,null,null,null,null,null,null,null,null,null,null,null,null,0,0,0,0,null,999,null,0]
[412,98.8,50,2018,101,26,103,0,null,null,null,null,null,null,null,null,null,null,null,null,null,null,null,null,null,null,null,null,null,null,null,null,null,null,null,null,null,null,null,null,null,null,null,null,null,null,null,null,null,null,null,null,null,null,null,null,null,null,null,null,0,0,0,0,null,999,null,0]
[413,96.4,100,2018,101,56,103,0,null,null,null,null,null,null,null,null,null,null,null,null,null,null,null,null,null,null,null,null,null,null,null,null,null,null,null,null,null,null,null,null,null,null,null,null,null,null,null,null,null,null,null,null,null,null,null,null,null,null,null,null,99.4,173.95,0,83,null,173.95,null,0]
[414,100,150,2018,101,70,103,0,null,null,null,null,null,null,null,null,null,null,null,null,null,null,null,null,null,null,null,null,null,null,null,null,null,null,null,null,null,null,null,null,null,null,null,null,null,null,null,null,null,null,null,null,null,null,null,null,null,null,null,null,100,175,40,98,null,175,null,37.220363602009435]
[415,null,null,null,null,null,null,null,null,null,null,null,null,null,null,null,null,null,null,null,null,null,null,null,null,null,null,null,null,null,null,null,null,null,null,null,null,null,null,null,null,null,null,null,null,null,null,null,null,null,null,null,null,null,null,null,null,null,null,null,97.1,169.92500000000001,80,114,null,169.92500000000001,null,74.44072720401887]
[416,null,null,null,null,null,null,null,null,null,null,null,null,null,null,null,null,null,null,null,null,null,null,null,null,null,null,null,null,null,null,null,null,null,null,null,null,null,null,null,null,null,null,null,null,null,null,null,null,null,null,null,null,null,null,null,null,null,null,null,0,0,0,0,null,999,null,0]
[417,null,null,null,null,null,null,null,null,null,null,null,null,null,null,null,null,null,null,null,null,null,null,null,null,null,null,null,null,null,null,null,null,null,null,null,null,null,null,null,null,null,null,null,null,null,null,null,null,null,null,null,null,null,null,null,null,null,null,null,0,0,0,0,null,999,null,0]
[418,null,null,null,null,null,null,null,null,null,null,null,null,null,null,null,null,null,null,null,null,null,null,null,null,null,null,null,null,null,null,null,null,null,null,null,null,null,null,null,null,null,null,null,null,null,null,null,null,null,null,null,null,null,null,null,null,null,null,null,99.7,174.47499999999999,0,75,null,174.47499999999999,null,0]
[419,null,null,null,null,null,null,null,null,null,null,null,null,null,null,null,null,null,null,null,null,null,null,null,null,null,null,null,null,null,null,null,null,null,null,null,null,null,null,null,null,null,null,null,null,null,null,null,null,null,null,null,null,null,null,null,null,null,null,null,98.1,171.67500000000001,40,86,null,171.67500000000001,null,37.220363602009435]
[420,null,null,null,null,null,null,null,null,null,null,null,null,null,null,null,null,null,null,null,null,null,null,null,null,null,null,null,null,null,null,null,null,null,null,null,null,null,null,null,null,null,null,null,null,null,null,null,null,null,null,null,null,null,null,null,null,null,null,null,99.7,174.47499999999999,80,98,null,174.47499999999999,null,74.44072720401887]
[421,null,null,null,null,null,null,null,null,null,null,null,null,null,null,null,null,null,null,null,null,null,null,null,null,null,null,null,null,null,null,null,null,null,null,null,null,null,null,null,null,null,null,null,null,null,null,null,null,null,null,null,null,null,null,null,null,null,null,null,100,175,120,115,null,175,null,111.6610908060283]
[422,null,null,null,null,null,null,null,null,null,null,null,null,null,null,null,null,null,null,null,null,null,null,null,null,null,null,null,null,null,null,null,null,null,null,null,null,null,null,null,null,null,null,null,null,null,null,null,null,null,null,null,null,null,null,null,null,null,null,null,0,0,0,0,null,999,null,0]
[423,null,null,null,null,null,null,null,null,null,null,null,null,null,null,null,null,null,null,null,null,null,null,null,null,null,null,null,null,null,null,null,null,null,null,null,null,null,null,null,null,null,null,null,null,null,null,null,null,null,null,null,null,null,null,null,null,null,null,null,0,0,0,0,null,999,null,0]
[424,null,null,null,null,null,null,null,null,null,null,null,null,null,null,null,null,null,null,null,null,null,null,null,null,null,null,null,null,null,null,null,null,null,null,null,null,null,null,null,null,null,null,null,null,null,null,null,null,null,null,null,null,null,null,null,null,null,null,null,0,0,0,0,null,999,null,0]
[425,null,null,null,null,null,null,null,null,null,null,null,null,null,null,null,null,null,null,null,null,null,null,null,null,null,null,null,null,null,null,null,null,null,null,null,null,null,null,null,null,null,null,null,null,null,null,null,null,null,null,null,null,null,null,null,null,null,null,null,0,0,0,0,null,999,null,0]
[426,null,null,null,null,null,null,null,null,null,null,null,null,null,null,null,null,null,null,null,null,null,null,null,null,null,null,null,null,null,null,null,null,null,null,null,null,null,null,null,null,null,null,null,null,null,null,null,null,null,null,null,null,null,null,null,null,null,null,null,97.8,171.15,120,78,null,171.15,null,111.6610908060283]
[427,null,null,null,null,null,null,null,null,null,null,null,null,null,null,null,null,null,null,null,null,null,null,null,null,null,null,null,null,null,null,null,null,null,null,null,null,null,null,null,null,null,null,null,null,null,null,null,null,null,null,null,null,null,null,null,null,null,null,null,100,175,160,94,null,175,null,148.88145440803774]
[428,null,null,null,null,null,null,null,null,null,null,null,null,null,null,null,null,null,null,null,null,null,null,null,null,null,null,null,null,null,null,null,null,null,null,null,null,null,null,null,null,null,null,null,null,null,null,null,null,null,null,null,null,null,null,null,null,null,null,null,0,0,0,0,null,999,null,0]
[429,null,null,null,null,null,null,null,null,null,null,null,null,null,null,null,null,null,null,null,null,null,null,null,null,null,null,null,null,null,null,null,null,null,null,null,null,null,null,null,null,null,null,null,null,null,null,null,null,null,null,null,null,null,null,null,null,null,null,null,0,0,0,0,null,999,null,0]
[430,null,null,null,null,null,null,null,null,null,null,null,null,null,null,null,null,null,null,null,null,null,null,null,null,null,null,null,null,null,null,null,null,null,null,null,null,null,null,null,null,null,null,null,null,null,null,null,null,null,null,null,null,null,null,null,null,null,null,null,0,0,0,0,null,999,null,0]
[431,null,null,null,null,null,null,null,null,null,null,null,null,null,null,null,null,null,null,null,null,null,null,null,null,null,null,null,null,null,null,null,null,null,null,null,null,null,null,null,null,null,null,null,null,null,null,null,null,null,null,null,null,null,null,null,null,null,null,null,{"$f":"_xlfn.NUMBERVALUE(IF(AND($G259>=($U$151-$Y$151),$G259<=($U$151+$Y$151)),B259,\"\"))","v":99.9},{"$f":"_xlfn.NUMBERVALUE(IFERROR(+BI432*$W$149,\"\"))","v":174.82499999999999},{"$f":"_xlfn.NUMBERVALUE(IF(AND($G259>=($U$151-$Y$151),$G259<=($U$151+$Y$151)),C259,\"\"))","v":120},{"$f":"_xlfn.NUMBERVALUE(IF(AND($G259>=($U$151-$Y$151),$G259<=($U$151+$Y$151)),G259,\"\"))","v":79},null,{"$f":"IF(BJ432=0,999,BJ432)","v":174.82499999999999},null,{"$f":"+BK432*$BP$172","v":111.6610908060283}]
[432,null,null,null,null,null,null,null,null,null,null,null,null,null,null,null,null,null,null,null,null,null,null,null,null,null,null,null,null,null,null,null,null,null,null,null,null,null,null,null,null,null,null,null,null,null,null,null,null,null,null,null,null,null,null,null,null,null,null,null,100,175,160,89,null,175,null,148.88145440803774]
[433,null,null,null,null,null,null,null,null,null,null,null,null,null,null,null,null,null,null,null,null,null,null,null,null,null,null,null,null,null,null,null,null,null,null,null,null,null,null,null,null,null,null,null,null,null,null,null,null,null,null,null,null,null,null,null,null,null,null,null,0,0,0,0,null,999,null,0]
[434,null,null,null,null,null,null,null,null,null,null,null,null,null,null,null,null,null,null,null,null,null,null,null,null,null,null,null,null,null,null,null,null,null,null,null,null,null,null,null,null,null,null,null,null,null,null,null,null,null,null,null,null,null,null,null,null,null,null,null,0,0,0,0,null,999,null,0]
[435,null,null,null,null,null,null,null,null,null,null,null,null,null,null,null,null,null,null,null,null,null,null,null,null,null,null,null,null,null,null,null,null,null,null,null,null,null,null,null,null,null,null,null,null,null,null,null,null,null,null,null,null,null,null,null,null,null,null,null,0,0,0,0,null,999,null,0]
[436,null,null,null,null,null,null,null,null,null,null,null,null,null,null,null,null,null,null,null,null,null,null,null,null,null,null,null,null,null,null,null,null,null,null,null,null,null,null,null,null,null,null,null,null,null,null,null,null,null,null,null,null,null,null,null,null,null,null,null,97.4,170.45,120,79,null,170.45,null,111.6610908060283]
[437,null,null,null,null,null,null,null,null,null,null,null,null,null,null,null,null,null,null,null,null,null,null,null,null,null,null,null,null,null,null,null,null,null,null,null,null,null,null,null,null,null,null,null,null,null,null,null,null,null,null,null,null,null,null,null,null,null,null,null,100,175,160,101,null,175,null,148.88145440803774]
[438,null,null,null,null,null,null,null,null,null,null,null,null,null,null,null,null,null,null,null,null,null,null,null,null,null,null,null,null,null,null,null,null,null,null,null,null,null,null,null,null,null,null,null,null,null,null,null,null,null,null,null,null,null,null,null,null,null,null,null,0,0,0,0,null,999,null,0]
[439,null,null,null,null,null,null,null,null,null,null,null,null,null,null,null,null,null,null,null,null,null,null,null,null,null,null,null,null,null,null,null,null,null,null,null,null,null,null,null,null,null,null,null,null,null,null,null,null,null,null,null,null,null,null,null,null,null,null,null,0,0,0,0,null,999,null,0]
[440,null,null,null,null,null,null,null,null,null,null,null,null,null,null,null,null,null,null,null,null,null,null,null,null,null,null,null,null,null,null,null,null,null,null,null,null,null,null,null,null,null,null,null,null,null,null,null,null,null,null,null,null,null,null,null,null,null,null,null,0,0,0,0,null,999,null,0]
[441,null,null,null,null,null,null,null,null,null,null,null,null,null,null,null,null,null,null,null,null,null,null,null,null,null,null,null,null,null,null,null,null,null,null,null,null,null,null,null,null,null,null,null,null,null,null,null,null,null,null,null,null,null,null,null,null,null,null,null,99.3,173.77500000000001,120,84,null,173.77500000000001,null,111.6610908060283]
[442,null,null,null,null,null,null,null,null,null,null,null,null,null,null,null,null,null,null,null,null,null,null,null,null,null,null,null,null,null,null,null,null,null,null,null,null,null,null,null,null,null,null,null,null,null,null,null,null,null,null,null,null,null,null,null,null,null,null,null,100,175,160,93,null,175,null,148.88145440803774]
[443,null,null,null,null,null,null,null,null,null,null,null,null,null,null,null,null,null,null,null,null,null,null,null,null,null,null,null,null,null,null,null,null,null,null,null,null,null,null,null,null,null,null,null,null,null,null,null,null,null,null,null,null,null,null,null,null,null,null,null,0,0,0,0,null,999,null,0]
[444,null,null,null,null,null,null,null,null,null,null,null,null,null,null,null,null,null,null,null,null,null,null,null,null,null,null,null,null,null,null,null,null,null,null,null,null,null,null,null,null,null,null,null,null,null,null,null,null,null,null,null,null,null,null,null,null,null,null,null,0,0,0,0,null,999,null,0]
[445,null,null,null,null,null,null,null,null,null,null,null,null,null,null,null,null,null,null,null,null,null,null,null,null,null,null,null,null,null,null,null,null,null,null,null,null,null,null,null,null,null,null,null,null,null,null,null,null,null,null,null,null,null,null,null,null,null,null,null,0,0,0,0,null,999,null,0]
[null,null,null,null,null,null,null,null,null,null,null,null,null,null,null,null,null,null,null,null,null,null,null,null,null,null,null,null,null,null,null,null,null,null,null,null,null,null,null,null,null,null,null,null,null,null,null,null,null,null,null,null,null,null,null,null,null,null,null,null,97.5,170.625,120,76,null,170.625,null,111.6610908060283]
[null,null,null,null,null,null,{"$f":"MIN(G2:G446)","v":35},null,null,null,null,null,null,null,null,null,null,null,null,null,null,null,null,null,null,null,null,null,null,null,null,null,null,null,null,null,null,null,null,null,null,null,null,null,null,null,null,null,null,null,null,null,null,null,null,null,null,null,null,null,100,175,160,92,null,175,null,148.88145440803774]
[null,null,null,null,null,null,{"$f":"MAX(G2:G446)","v":223},null,null,null,null,null,null,null,null,null,null,null,null,null,null,null,null,null,null,null,null,null,null,null,null,null,null,null,null,null,null,null,null,null,null,null,null,null,null,null,null,null,null,null,null,null,null,null,null,null,null,null,null,null,0,0,0,0,null,999,null,0]
[null,null,null,null,null,null,null,null,null,null,null,null,null,null,null,null,null,null,null,null,null,null,null,null,null,null,null,null,null,null,null,null,null,null,null,null,null,null,null,null,null,null,null,null,null,null,null,null,null,null,null,null,null,null,null,null,null,null,null,null,0,0,0,0,null,999,null,0]
[null,null,null,null,null,null,null,null,null,null,null,null,null,null,null,null,null,null,null,null,null,null,null,null,null,null,null,null,null,null,null,null,null,null,null,null,null,null,null,null,null,null,null,null,null,null,null,null,null,null,null,null,null,null,null,null,null,null,null,null,0,0,0,0,null,999,null,0]
[null,null,null,null,null,null,null,null,null,null,null,null,null,null,null,null,null,null,null,null,null,null,null,null,null,null,null,null,null,null,null,null,null,null,null,null,null,null,null,null,null,null,null,null,null,null,null,null,null,null,null,null,null,null,null,null,null,null,null,null,0,0,0,0,null,999,null,0]
[null,null,null,null,null,null,null,null,null,null,null,null,null,null,null,null,null,null,null,null,null,null,null,null,null,null,null,null,null,null,null,null,null,null,null,null,null,null,null,null,null,null,null,null,null,null,null,null,null,null,null,null,null,null,null,null,null,null,null,null,100,175,160,81,null,175,null,148.88145440803774]
[null,null,null,null,null,null,null,null,null,null,null,null,null,null,null,null,null,null,null,null,null,null,null,null,null,null,null,null,null,null,null,null,null,null,null,null,null,null,null,null,null,null,null,null,null,null,null,null,null,null,null,null,null,null,null,null,null,null,null,null,0,0,0,0,null,999,null,0]
[null,null,null,null,null,null,null,null,null,null,null,null,null,null,null,null,null,null,null,null,null,null,null,null,null,null,null,null,null,null,null,null,null,null,null,null,null,null,null,null,null,null,null,null,null,null,null,null,null,null,null,null,null,null,null,null,null,null,null,null,0,0,0,0,null,999,null,0]
[null,null,null,null,null,null,null,null,null,null,null,null,null,null,null,null,null,null,null,null,null,null,null,null,null,null,null,null,null,null,null,null,null,null,null,null,null,null,null,null,null,null,null,null,null,null,null,null,null,null,null,null,null,null,null,null,null,null,null,null,0,0,0,0,null,999,null,0]
[null,null,null,null,null,null,null,null,null,null,null,null,null,null,null,null,null,null,null,null,null,null,null,null,null,null,null,null,null,null,null,null,null,null,null,null,null,null,null,null,null,null,null,null,null,null,null,null,null,null,null,null,null,null,null,null,null,null,null,null,0,0,0,0,null,999,null,0]
[null,null,null,null,null,null,null,null,null,null,null,null,null,null,null,null,null,null,null,null,null,null,null,null,null,null,null,null,null,null,null,null,null,null,null,null,null,null,null,null,null,null,null,null,null,null,null,null,null,null,null,null,null,null,null,null,null,null,null,null,100,175,160,76,null,175,null,148.88145440803774]
[null,null,null,null,null,null,null,null,null,null,null,null,null,null,null,null,null,null,null,null,null,null,null,null,null,null,null,null,null,null,null,null,null,null,null,null,null,null,null,null,null,null,null,null,null,null,null,null,null,null,null,null,null,null,null,null,null,null,null,null,97,169.75,0,76,null,169.75,null,0]
[null,null,null,null,null,null,null,null,null,null,null,null,null,null,null,null,null,null,null,null,null,null,null,null,null,null,null,null,null,null,null,null,null,null,null,null,null,null,null,null,null,null,null,null,null,null,null,null,null,null,null,null,null,null,null,null,null,null,null,null,96.3,168.52500000000001,50,76,null,168.52500000000001,null,46.525454502511792]
[null,null,null,null,null,null,null,null,null,null,null,null,null,null,null,null,null,null,null,null,null,null,null,null,null,null,null,null,null,null,null,null,null,null,null,null,null,null,null,null,null,null,null,null,null,null,null,null,null,null,null,null,null,null,null,null,null,null,null,null,100,175,100,76,null,175,null,93.050909005023584]
[null,null,null,null,null,null,null,null,null,null,null,null,null,null,null,null,null,null,null,null,null,null,null,null,null,null,null,null,null,null,null,null,null,null,null,null,null,null,null,null,null,null,null,null,null,null,null,null,null,null,null,null,null,null,null,null,null,null,null,null,98.3,172.02500000000001,150,76,null,172.02500000000001,null,139.57636350753538]
[null,null,null,null,null,null,null,null,null,null,null,null,null,null,null,null,null,null,null,null,null,null,null,null,null,null,null,null,null,null,null,null,null,null,null,null,null,null,null,null,null,null,null,null,null,null,null,null,null,null,null,null,null,null,null,null,null,null,null,null,0,0,0,0,null,999,null,0]
[null,null,null,null,null,null,null,null,null,null,null,null,null,null,null,null,null,null,null,null,null,null,null,null,null,null,null,null,null,null,null,null,null,null,null,null,null,null,null,null,null,null,null,null,null,null,null,null,null,null,null,null,null,null,null,null,null,null,null,null,0,0,0,0,null,999,null,0]
[null,null,null,null,null,null,null,null,null,null,null,null,null,null,null,null,null,null,null,null,null,null,null,null,null,null,null,null,null,null,null,null,null,null,null,null,null,null,null,null,null,null,null,null,null,null,null,null,null,null,null,null,null,null,null,null,null,null,null,null,0,0,0,0,null,999,null,0]
[null,null,null,null,null,null,null,null,null,null,null,null,null,null,null,null,null,null,null,null,null,null,null,null,null,null,null,null,null,null,null,null,null,null,null,null,null,null,null,null,null,null,null,null,null,null,null,null,null,null,null,null,null,null,null,null,null,null,null,null,0,0,0,0,null,999,null,0]
[null,null,null,null,null,null,null,null,null,null,null,null,null,null,null,null,null,null,null,null,null,null,null,null,null,null,null,null,null,null,null,null,null,null,null,null,null,null,null,null,null,null,null,null,null,null,null,null,null,null,null,null,null,null,null,null,null,null,null,null,0,0,0,0,null,999,null,0]
[null,null,null,null,null,null,null,null,null,null,null,null,null,null,null,null,null,null,null,null,null,null,null,null,null,null,null,null,null,null,null,null,null,null,null,null,null,null,null,null,null,null,null,null,null,null,null,null,null,null,null,null,null,null,null,null,null,null,null,null,0,0,0,0,null,999,null,0]
[null,null,null,null,null,null,null,null,null,null,null,null,null,null,null,null,null,null,null,null,null,null,null,null,null,null,null,null,null,null,null,null,null,null,null,null,null,null,null,null,null,null,null,null,null,null,null,null,null,null,null,null,null,null,null,null,null,null,null,null,0,0,0,0,null,999,null,0]
[null,null,null,null,null,null,null,null,null,null,null,null,null,null,null,null,null,null,null,null,null,null,null,null,null,null,null,null,null,null,null,null,null,null,null,null,null,null,null,null,null,null,null,null,null,null,null,null,null,null,null,null,null,null,null,null,null,null,null,null,0,0,0,0,null,999,null,0]
[null,null,null,null,null,null,null,null,null,null,null,null,null,null,null,null,null,null,null,null,null,null,null,null,null,null,null,null,null,null,null,null,null,null,null,null,null,null,null,null,null,null,null,null,null,null,null,null,null,null,null,null,null,null,null,null,null,null,null,null,0,0,0,0,null,999,null,0]
[null,null,null,null,null,null,null,null,null,null,null,null,null,null,null,null,null,null,null,null,null,null,null,null,null,null,null,null,null,null,null,null,null,null,null,null,null,null,null,null,null,null,null,null,null,null,null,null,null,null,null,null,null,null,null,null,null,null,null,null,0,0,0,0,null,999,null,0]
[null,null,null,null,null,null,null,null,null,null,null,null,null,null,null,null,null,null,null,null,null,null,null,null,null,null,null,null,null,null,null,null,null,null,null,null,null,null,null,null,null,null,null,null,null,null,null,null,null,null,null,null,null,null,null,null,null,null,null,null,97.4,170.45,0,85,null,170.45,null,0]
[null,null,null,null,null,null,null,null,null,null,null,null,null,null,null,null,null,null,null,null,null,null,null,null,null,null,null,null,null,null,null,null,null,null,null,null,null,null,null,null,null,null,null,null,null,null,null,null,null,null,null,null,null,null,null,null,null,null,null,null,100,175,40,85,null,175,null,37.220363602009435]
[null,null,null,null,null,null,null,null,null,null,null,null,null,null,null,null,null,null,null,null,null,null,null,null,null,null,null,null,null,null,null,null,null,null,null,null,null,null,null,null,null,null,null,null,null,null,null,null,null,null,null,null,null,null,null,null,null,null,null,null,99.5,174.125,80,85,null,174.125,null,74.44072720401887]
[null,null,null,null,null,null,null,null,null,null,null,null,null,null,null,null,null,null,null,null,null,null,null,null,null,null,null,null,null,null,null,null,null,null,null,null,null,null,null,null,null,null,null,null,null,null,null,null,null,null,null,null,null,null,null,null,null,null,null,null,97.5,170.625,120,85,null,170.625,null,111.6610908060283]
[null,null,null,null,null,null,null,null,null,null,null,null,null,null,null,null,null,null,null,null,null,null,null,null,null,null,null,null,null,null,null,null,null,null,null,null,null,null,null,null,null,null,null,null,null,null,null,null,null,null,null,null,null,null,null,null,null,null,null,null,99.5,174.125,160,85,null,174.125,null,148.88145440803774]
[null,null,null,null,null,null,null,null,null,null,null,null,null,null,null,null,null,null,null,null,null,null,null,null,null,null,null,null,null,null,null,null,null,null,null,null,null,null,null,null,null,null,null,null,null,null,null,null,null,null,null,null,null,null,null,null,null,null,null,null,101.7,177.97499999999999,0,114,null,177.97499999999999,null,0]
[null,null,null,null,null,null,null,null,null,null,null,null,null,null,null,null,null,null,null,null,null,null,null,null,null,null,null,null,null,null,null,null,null,null,null,null,null,null,null,null,null,null,null,null,null,null,null,null,null,null,null,null,null,null,null,null,null,null,null,null,98.2,171.85,40,114,null,171.85,null,37.220363602009435]
[null,null,null,null,null,null,null,null,null,null,null,null,null,null,null,null,null,null,null,null,null,null,null,null,null,null,null,null,null,null,null,null,null,null,null,null,null,null,null,null,null,null,null,null,null,null,null,null,null,null,null,null,null,null,null,null,null,null,null,null,100,175,80,114,null,175,null,74.44072720401887]
[null,null,null,null,null,null,null,null,null,null,null,null,null,null,null,null,null,null,null,null,null,null,null,null,null,null,null,null,null,null,null,null,null,null,null,null,null,null,null,null,null,null,null,null,null,null,null,null,null,null,null,null,null,null,null,null,null,null,null,null,97.5,170.625,120,114,null,170.625,null,111.6610908060283]
[null,null,null,null,null,null,null,null,null,null,null,null,null,null,null,null,null,null,null,null,null,null,null,null,null,null,null,null,null,null,null,null,null,null,null,null,null,null,null,null,null,null,null,null,null,null,null,null,null,null,null,null,null,null,null,null,null,null,null,null,97.5,170.625,160,114,null,170.625,null,148.88145440803774]
[null,null,null,null,null,null,null,null,null,null,null,null,null,null,null,null,null,null,null,null,null,null,null,null,null,null,null,null,null,null,null,null,null,null,null,null,null,null,null,null,null,null,null,null,null,null,null,null,null,null,null,null,null,null,null,null,null,null,null,null,99.8,174.65,0,107,null,174.65,null,0]
[null,null,null,null,null,null,null,null,null,null,null,null,null,null,null,null,null,null,null,null,null,null,null,null,null,null,null,null,null,null,null,null,null,null,null,null,null,null,null,null,null,null,null,null,null,null,null,null,null,null,null,null,null,null,null,null,null,null,null,null,100,175,40,107,null,175,null,37.220363602009435]
[null,null,null,null,null,null,null,null,null,null,null,null,null,null,null,null,null,null,null,null,null,null,null,null,null,null,null,null,null,null,null,null,null,null,null,null,null,null,null,null,null,null,null,null,null,null,null,null,null,null,null,null,null,null,null,null,null,null,null,null,97.9,171.32499999999999,80,107,null,171.32499999999999,null,74.44072720401887]
[null,null,null,null,null,null,null,null,null,null,null,null,null,null,null,null,null,null,null,null,null,null,null,null,null,null,null,null,null,null,null,null,null,null,null,null,null,null,null,null,null,null,null,null,null,null,null,null,null,null,null,null,null,null,null,null,null,null,null,null,100,175,120,107,null,175,null,111.6610908060283]
[null,null,null,null,null,null,null,null,null,null,null,null,null,null,null,null,null,null,null,null,null,null,null,null,null,null,null,null,null,null,null,null,null,null,null,null,null,null,null,null,null,null,null,null,null,null,null,null,null,null,null,null,null,null,null,null,null,null,null,null,97.8,171.15,160,107,null,171.15,null,148.88145440803774]
[null,null,null,null,null,null,null,null,null,null,null,null,null,null,null,null,null,null,null,null,null,null,null,null,null,null,null,null,null,null,null,null,null,null,null,null,null,null,null,null,null,null,null,null,null,null,null,null,null,null,null,null,null,null,null,null,null,null,null,null,0,0,0,0,null,999,null,0]
[null,null,null,null,null,null,null,null,null,null,null,null,null,null,null,null,null,null,null,null,null,null,null,null,null,null,null,null,null,null,null,null,null,null,null,null,null,null,null,null,null,null,null,null,null,null,null,null,null,null,null,null,null,null,null,null,null,null,null,null,0,0,0,0,null,999,null,0]
[null,null,null,null,null,null,null,null,null,null,null,null,null,null,null,null,null,null,null,null,null,null,null,null,null,null,null,null,null,null,null,null,null,null,null,null,null,null,null,null,null,null,null,null,null,null,null,null,null,null,null,null,null,null,null,null,null,null,null,null,0,0,0,0,null,999,null,0]
[null,null,null,null,null,null,null,null,null,null,null,null,null,null,null,null,null,null,null,null,null,null,null,null,null,null,null,null,null,null,null,null,null,null,null,null,null,null,null,null,null,null,null,null,null,null,null,null,null,null,null,null,null,null,null,null,null,null,null,null,0,0,0,0,null,999,null,0]
[null,null,null,null,null,null,null,null,null,null,null,null,null,null,null,null,null,null,null,null,null,null,null,null,null,null,null,null,null,null,null,null,null,null,null,null,null,null,null,null,null,null,null,null,null,null,null,null,null,null,null,null,null,null,null,null,null,null,null,null,94.2,164.85,0,97,null,164.85,null,0]
[null,null,null,null,null,null,null,null,null,null,null,null,null,null,null,null,null,null,null,null,null,null,null,null,null,null,null,null,null,null,null,null,null,null,null,null,null,null,null,null,null,null,null,null,null,null,null,null,null,null,null,null,null,null,null,null,null,null,null,null,98.5,172.375,60,97,null,172.375,null,55.830545403014149]
[null,null,null,null,null,null,null,null,null,null,null,null,null,null,null,null,null,null,null,null,null,null,null,null,null,null,null,null,null,null,null,null,null,null,null,null,null,null,null,null,null,null,null,null,null,null,null,null,null,null,null,null,null,null,null,null,null,null,null,null,98.2,171.85,90,97,null,171.85,null,83.74581810452122]
[null,null,null,null,null,null,null,null,null,null,null,null,null,null,null,null,null,null,null,null,null,null,null,null,null,null,null,null,null,null,null,null,null,null,null,null,null,null,null,null,null,null,null,null,null,null,null,null,null,null,null,null,null,null,null,null,null,null,null,null,100,175,120,97,null,175,null,111.6610908060283]
[null,null,null,null,null,null,null,null,null,null,null,null,null,null,null,null,null,null,null,null,null,null,null,null,null,null,null,null,null,null,null,null,null,null,null,null,null,null,null,null,null,null,null,null,null,null,null,null,null,null,null,null,null,null,null,null,null,null,null,null,{"$f":"_xlfn.NUMBERVALUE(IF(AND($G323>=($U$151-$Y$151),$G323<=($U$151+$Y$151)),B323,\"\"))","v":97.3},{"$f":"_xlfn.NUMBERVALUE(IFERROR(+BI496*$W$149,\"\"))","v":170.27500000000001},{"$f":"_xlfn.NUMBERVALUE(IF(AND($G323>=($U$151-$Y$151),$G323<=($U$151+$Y$151)),C323,\"\"))","v":0},{"$f":"_xlfn.NUMBERVALUE(IF(AND($G323>=($U$151-$Y$151),$G323<=($U$151+$Y$151)),G323,\"\"))","v":108},null,{"$f":"IF(BJ496=0,999,BJ496)","v":170.27500000000001},null,{"$f":"+BK496*$BP$172","v":0}]
[null,null,null,null,null,null,null,null,null,null,null,null,null,null,null,null,null,null,null,null,null,null,null,null,null,null,null,null,null,null,null,null,null,null,null,null,null,null,null,null,null,null,null,null,null,null,null,null,null,null,null,null,null,null,null,null,null,null,null,null,99.4,173.95,60,108,null,173.95,null,55.830545403014149]
[null,null,null,null,null,null,null,null,null,null,null,null,null,null,null,null,null,null,null,null,null,null,null,null,null,null,null,null,null,null,null,null,null,null,null,null,null,null,null,null,null,null,null,null,null,null,null,null,null,null,null,null,null,null,null,null,null,null,null,null,99.3,173.77500000000001,90,108,null,173.77500000000001,null,83.74581810452122]
[null,null,null,null,null,null,null,null,null,null,null,null,null,null,null,null,null,null,null,null,null,null,null,null,null,null,null,null,null,null,null,null,null,null,null,null,null,null,null,null,null,null,null,null,null,null,null,null,null,null,null,null,null,null,null,null,null,null,null,null,100,175,120,108,null,175,null,111.6610908060283]
[null,null,null,null,null,null,null,null,null,null,null,null,null,null,null,null,null,null,null,null,null,null,null,null,null,null,null,null,null,null,null,null,null,null,null,null,null,null,null,null,null,null,null,null,null,null,null,null,null,null,null,null,null,null,null,null,null,null,null,null,0,0,0,0,null,999,null,0]
[null,null,null,null,null,null,null,null,null,null,null,null,null,null,null,null,null,null,null,null,null,null,null,null,null,null,null,null,null,null,null,null,null,null,null,null,null,null,null,null,null,null,null,null,null,null,null,null,null,null,null,null,null,null,null,null,null,null,null,null,0,0,0,0,null,999,null,0]
[null,null,null,null,null,null,null,null,null,null,null,null,null,null,null,null,null,null,null,null,null,null,null,null,null,null,null,null,null,null,null,null,null,null,null,null,null,null,null,null,null,null,null,null,null,null,null,null,null,null,null,null,null,null,null,null,null,null,null,null,0,0,0,0,null,999,null,0]
[null,null,null,null,null,null,null,null,null,null,null,null,null,null,null,null,null,null,null,null,null,null,null,null,null,null,null,null,null,null,null,null,null,null,null,null,null,null,null,null,null,null,null,null,null,null,null,null,null,null,null,null,null,null,null,null,null,null,null,null,0,0,0,0,null,999,null,0]
[null,null,null,null,null,null,null,null,null,null,null,null,null,null,null,null,null,null,null,null,null,null,null,null,null,null,null,null,null,null,null,null,null,null,null,null,null,null,null,null,null,null,null,null,null,null,null,null,null,null,null,null,null,null,null,null,null,null,null,null,92,161,0,88,null,161,null,0]
[null,null,null,null,null,null,null,null,null,null,null,null,null,null,null,null,null,null,null,null,null,null,null,null,null,null,null,null,null,null,null,null,null,null,null,null,null,null,null,null,null,null,null,null,null,null,null,null,null,null,null,null,null,null,null,null,null,null,null,null,92.9,162.57499999999999,60,88,null,162.57499999999999,null,55.830545403014149]
[null,null,null,null,null,null,null,null,null,null,null,null,null,null,null,null,null,null,null,null,null,null,null,null,null,null,null,null,null,null,null,null,null,null,null,null,null,null,null,null,null,null,null,null,null,null,null,null,null,null,null,null,null,null,null,null,null,null,null,null,92.8,162.4,90,88,null,162.4,null,83.74581810452122]
[null,null,null,null,null,null,null,null,null,null,null,null,null,null,null,null,null,null,null,null,null,null,null,null,null,null,null,null,null,null,null,null,null,null,null,null,null,null,null,null,null,null,null,null,null,null,null,null,null,null,null,null,null,null,null,null,null,null,null,null,100,175,120,88,null,175,null,111.6610908060283]
[null,null,null,null,null,null,null,null,null,null,null,null,null,null,null,null,null,null,null,null,null,null,null,null,null,null,null,null,null,null,null,null,null,null,null,null,null,null,null,null,null,null,null,null,null,null,null,null,null,null,null,null,null,null,null,null,null,null,null,null,0,0,0,0,null,999,null,0]
[null,null,null,null,null,null,null,null,null,null,null,null,null,null,null,null,null,null,null,null,null,null,null,null,null,null,null,null,null,null,null,null,null,null,null,null,null,null,null,null,null,null,null,null,null,null,null,null,null,null,null,null,null,null,null,null,null,null,null,null,0,0,0,0,null,999,null,0]
[null,null,null,null,null,null,null,null,null,null,null,null,null,null,null,null,null,null,null,null,null,null,null,null,null,null,null,null,null,null,null,null,null,null,null,null,null,null,null,null,null,null,null,null,null,null,null,null,null,null,null,null,null,null,null,null,null,null,null,null,0,0,0,0,null,999,null,0]
[null,null,null,null,null,null,null,null,null,null,null,null,null,null,null,null,null,null,null,null,null,null,null,null,null,null,null,null,null,null,null,null,null,null,null,null,null,null,null,null,null,null,null,null,null,null,null,null,null,null,null,null,null,null,null,null,null,null,null,null,0,0,0,0,null,999,null,0]
[null,null,null,null,null,null,null,null,null,null,null,null,null,null,null,null,null,null,null,null,null,null,null,null,null,null,null,null,null,null,null,null,null,null,null,null,null,null,null,null,null,null,null,null,null,null,null,null,null,null,null,null,null,null,null,null,null,null,null,null,0,0,0,0,null,999,null,0]
[null,null,null,null,null,null,null,null,null,null,null,null,null,null,null,null,null,null,null,null,null,null,null,null,null,null,null,null,null,null,null,null,null,null,null,null,null,null,null,null,null,null,null,null,null,null,null,null,null,null,null,null,null,null,null,null,null,null,null,null,0,0,0,0,null,999,null,0]
[null,null,null,null,null,null,null,null,null,null,null,null,null,null,null,null,null,null,null,null,null,null,null,null,null,null,null,null,null,null,null,null,null,null,null,null,null,null,null,null,null,null,null,null,null,null,null,null,null,null,null,null,null,null,null,null,null,null,null,null,0,0,0,0,null,999,null,0]
[null,null,null,null,null,null,null,null,null,null,null,null,null,null,null,null,null,null,null,null,null,null,null,null,null,null,null,null,null,null,null,null,null,null,null,null,null,null,null,null,null,null,null,null,null,null,null,null,null,null,null,null,null,null,null,null,null,null,null,null,0,0,0,0,null,999,null,0]
[null,null,null,null,null,null,null,null,null,null,null,null,null,null,null,null,null,null,null,null,null,null,null,null,null,null,null,null,null,null,null,null,null,null,null,null,null,null,null,null,null,null,null,null,null,null,null,null,null,null,null,null,null,null,null,null,null,null,null,null,0,0,0,0,null,999,null,0]
[null,null,null,null,null,null,null,null,null,null,null,null,null,null,null,null,null,null,null,null,null,null,null,null,null,null,null,null,null,null,null,null,null,null,null,null,null,null,null,null,null,null,null,null,null,null,null,null,null,null,null,null,null,null,null,null,null,null,null,null,0,0,0,0,null,999,null,0]
[null,null,null,null,null,null,null,null,null,null,null,null,null,null,null,null,null,null,null,null,null,null,null,null,null,null,null,null,null,null,null,null,null,null,null,null,null,null,null,null,null,null,null,null,null,null,null,null,null,null,null,null,null,null,null,null,null,null,null,null,0,0,0,0,null,999,null,0]
[null,null,null,null,null,null,null,null,null,null,null,null,null,null,null,null,null,null,null,null,null,null,null,null,null,null,null,null,null,null,null,null,null,null,null,null,null,null,null,null,null,null,null,null,null,null,null,null,null,null,null,null,null,null,null,null,null,null,null,null,0,0,0,0,null,999,null,0]
[null,null,null,null,null,null,null,null,null,null,null,null,null,null,null,null,null,null,null,null,null,null,null,null,null,null,null,null,null,null,null,null,null,null,null,null,null,null,null,null,null,null,null,null,null,null,null,null,null,null,null,null,null,null,null,null,null,null,null,null,0,0,0,0,null,999,null,0]
[null,null,null,null,null,null,null,null,null,null,null,null,null,null,null,null,null,null,null,null,null,null,null,null,null,null,null,null,null,null,null,null,null,null,null,null,null,null,null,null,null,null,null,null,null,null,null,null,null,null,null,null,null,null,null,null,null,null,null,null,0,0,0,0,null,999,null,0]
[null,null,null,null,null,null,null,null,null,null,null,null,null,null,null,null,null,null,null,null,null,null,null,null,null,null,null,null,null,null,null,null,null,null,null,null,null,null,null,null,null,null,null,null,null,null,null,null,null,null,null,null,null,null,null,null,null,null,null,null,0,0,0,0,null,999,null,0]
[null,null,null,null,null,null,null,null,null,null,null,null,null,null,null,null,null,null,null,null,null,null,null,null,null,null,null,null,null,null,null,null,null,null,null,null,null,null,null,null,null,null,null,null,null,null,null,null,null,null,null,null,null,null,null,null,null,null,null,null,0,0,0,0,null,999,null,0]
[null,null,null,null,null,null,null,null,null,null,null,null,null,null,null,null,null,null,null,null,null,null,null,null,null,null,null,null,null,null,null,null,null,null,null,null,null,null,null,null,null,null,null,null,null,null,null,null,null,null,null,null,null,null,null,null,null,null,null,null,98.2,171.85,0,90,null,171.85,null,0]
[null,null,null,null,null,null,null,null,null,null,null,null,null,null,null,null,null,null,null,null,null,null,null,null,null,null,null,null,null,null,null,null,null,null,null,null,null,null,null,null,null,null,null,null,null,null,null,null,null,null,null,null,null,null,null,null,null,null,null,null,100,175,60,90,null,175,null,55.830545403014149]
[null,null,null,null,null,null,null,null,null,null,null,null,null,null,null,null,null,null,null,null,null,null,null,null,null,null,null,null,null,null,null,null,null,null,null,null,null,null,null,null,null,null,null,null,null,null,null,null,null,null,null,null,null,null,null,null,null,null,null,null,96.3,168.52500000000001,90,90,null,168.52500000000001,null,83.74581810452122]
[null,null,null,null,null,null,null,null,null,null,null,null,null,null,null,null,null,null,null,null,null,null,null,null,null,null,null,null,null,null,null,null,null,null,null,null,null,null,null,null,null,null,null,null,null,null,null,null,null,null,null,null,null,null,null,null,null,null,null,null,99,173.25,120,90,null,173.25,null,111.6610908060283]
[null,null,null,null,null,null,null,null,null,null,null,null,null,null,null,null,null,null,null,null,null,null,null,null,null,null,null,null,null,null,null,null,null,null,null,null,null,null,null,null,null,null,null,null,null,null,null,null,null,null,null,null,null,null,null,null,null,null,null,null,96.1,168.17500000000001,0,100,null,168.17500000000001,null,0]
[null,null,null,null,null,null,null,null,null,null,null,null,null,null,null,null,null,null,null,null,null,null,null,null,null,null,null,null,null,null,null,null,null,null,null,null,null,null,null,null,null,null,null,null,null,null,null,null,null,null,null,null,null,null,null,null,null,null,null,null,100,175,60,100,null,175,null,55.830545403014149]
[null,null,null,null,null,null,null,null,null,null,null,null,null,null,null,null,null,null,null,null,null,null,null,null,null,null,null,null,null,null,null,null,null,null,null,null,null,null,null,null,null,null,null,null,null,null,null,null,null,null,null,null,null,null,null,null,null,null,null,null,94.7,165.72499999999999,90,100,null,165.72499999999999,null,83.74581810452122]
[null,null,null,null,null,null,null,null,null,null,null,null,null,null,null,null,null,null,null,null,null,null,null,null,null,null,null,null,null,null,null,null,null,null,null,null,null,null,null,null,null,null,null,null,null,null,null,null,null,null,null,null,null,null,null,null,null,null,null,null,98.7,172.72499999999999,120,100,null,172.72499999999999,null,111.6610908060283]
[null,null,null,null,null,null,null,null,null,null,null,null,null,null,null,null,null,null,null,null,null,null,null,null,null,null,null,null,null,null,null,null,null,null,null,null,null,null,null,null,null,null,null,null,null,null,null,null,null,null,null,null,null,null,null,null,null,null,null,null,97.4,170.45,0,104,null,170.45,null,0]
[null,null,null,null,null,null,null,null,null,null,null,null,null,null,null,null,null,null,null,null,null,null,null,null,null,null,null,null,null,null,null,null,null,null,null,null,null,null,null,null,null,null,null,null,null,null,null,null,null,null,null,null,null,null,null,null,null,null,null,null,96.7,169.22499999999999,60,104,null,169.22499999999999,null,55.830545403014149]
[null,null,null,null,null,null,null,null,null,null,null,null,null,null,null,null,null,null,null,null,null,null,null,null,null,null,null,null,null,null,null,null,null,null,null,null,null,null,null,null,null,null,null,null,null,null,null,null,null,null,null,null,null,null,null,null,null,null,null,null,98.2,171.85,90,104,null,171.85,null,83.74581810452122]
[null,null,null,null,null,null,null,null,null,null,null,null,null,null,null,null,null,null,null,null,null,null,null,null,null,null,null,null,null,null,null,null,null,null,null,null,null,null,null,null,null,null,null,null,null,null,null,null,null,null,null,null,null,null,null,null,null,null,null,null,100,175,120,104,null,175,null,111.6610908060283]
[null,null,null,null,null,null,null,null,null,null,null,null,null,null,null,null,null,null,null,null,null,null,null,null,null,null,null,null,null,null,null,null,null,null,null,null,null,null,null,null,null,null,null,null,null,null,null,null,null,null,null,null,null,null,null,null,null,null,null,null,99.1,173.42500000000001,0,109,null,173.42500000000001,null,0]
[null,null,null,null,null,null,null,null,null,null,null,null,null,null,null,null,null,null,null,null,null,null,null,null,null,null,null,null,null,null,null,null,null,null,null,null,null,null,null,null,null,null,null,null,null,null,null,null,null,null,null,null,null,null,null,null,null,null,null,null,97.2,170.1,60,109,null,170.1,null,55.830545403014149]
[null,null,null,null,null,null,null,null,null,null,null,null,null,null,null,null,null,null,null,null,null,null,null,null,null,null,null,null,null,null,null,null,null,null,null,null,null,null,null,null,null,null,null,null,null,null,null,null,null,null,null,null,null,null,null,null,null,null,null,null,100,175,90,109,null,175,null,83.74581810452122]
[null,null,null,null,null,null,null,null,null,null,null,null,null,null,null,null,null,null,null,null,null,null,null,null,null,null,null,null,null,null,null,null,null,null,null,null,null,null,null,null,null,null,null,null,null,null,null,null,null,null,null,null,null,null,null,null,null,null,null,null,99.3,173.77500000000001,120,109,null,173.77500000000001,null,111.6610908060283]
[null,null,null,null,null,null,null,null,null,null,null,null,null,null,null,null,null,null,null,null,null,null,null,null,null,null,null,null,null,null,null,null,null,null,null,null,null,null,null,null,null,null,null,null,null,null,null,null,null,null,null,null,null,null,null,null,null,null,null,null,99,173.25,0,85,null,173.25,null,0]
[null,null,null,null,null,null,null,null,null,null,null,null,null,null,null,null,null,null,null,null,null,null,null,null,null,null,null,null,null,null,null,null,null,null,null,null,null,null,null,null,null,null,null,null,null,null,null,null,null,null,null,null,null,null,null,null,null,null,null,null,93.3,163.27500000000001,60,85,null,163.27500000000001,null,55.830545403014149]
[null,null,null,null,null,null,null,null,null,null,null,null,null,null,null,null,null,null,null,null,null,null,null,null,null,null,null,null,null,null,null,null,null,null,null,null,null,null,null,null,null,null,null,null,null,null,null,null,null,null,null,null,null,null,null,null,null,null,null,null,100,175,90,85,null,175,null,83.74581810452122]
[null,null,null,null,null,null,null,null,null,null,null,null,null,null,null,null,null,null,null,null,null,null,null,null,null,null,null,null,null,null,null,null,null,null,null,null,null,null,null,null,null,null,null,null,null,null,null,null,null,null,null,null,null,null,null,null,null,null,null,null,91.9,160.82499999999999,120,85,null,160.82499999999999,null,111.6610908060283]
[null,null,null,null,null,null,null,null,null,null,null,null,null,null,null,null,null,null,null,null,null,null,null,null,null,null,null,null,null,null,null,null,null,null,null,null,null,null,null,null,null,null,null,null,null,null,null,null,null,null,null,null,null,null,null,null,null,null,null,null,0,0,0,0,null,999,null,0]
[null,null,null,null,null,null,null,null,null,null,null,null,null,null,null,null,null,null,null,null,null,null,null,null,null,null,null,null,null,null,null,null,null,null,null,null,null,null,null,null,null,null,null,null,null,null,null,null,null,null,null,null,null,null,null,null,null,null,null,null,0,0,0,0,null,999,null,0]
[null,null,null,null,null,null,null,null,null,null,null,null,null,null,null,null,null,null,null,null,null,null,null,null,null,null,null,null,null,null,null,null,null,null,null,null,null,null,null,null,null,null,null,null,null,null,null,null,null,null,null,null,null,null,null,null,null,null,null,null,0,0,0,0,null,999,null,0]
[null,null,null,null,null,null,null,null,null,null,null,null,null,null,null,null,null,null,null,null,null,null,null,null,null,null,null,null,null,null,null,null,null,null,null,null,null,null,null,null,null,null,null,null,null,null,null,null,null,null,null,null,null,null,null,null,null,null,null,null,0,0,0,0,null,999,null,0]
[null,null,null,null,null,null,null,null,null,null,null,null,null,null,null,null,null,null,null,null,null,null,null,null,null,null,null,null,null,null,null,null,null,null,null,null,null,null,null,null,null,null,null,null,null,null,null,null,null,null,null,null,null,null,null,null,null,null,null,null,0,0,0,0,null,999,null,0]
[null,null,null,null,null,null,null,null,null,null,null,null,null,null,null,null,null,null,null,null,null,null,null,null,null,null,null,null,null,null,null,null,null,null,null,null,null,null,null,null,null,null,null,null,null,null,null,null,null,null,null,null,null,null,null,null,null,null,null,null,0,0,0,0,null,999,null,0]
[null,null,null,null,null,null,null,null,null,null,null,null,null,null,null,null,null,null,null,null,null,null,null,null,null,null,null,null,null,null,null,null,null,null,null,null,null,null,null,null,null,null,null,null,null,null,null,null,null,null,null,null,null,null,null,null,null,null,null,null,0,0,0,0,null,999,null,0]
[null,null,null,null,null,null,null,null,null,null,null,null,null,null,null,null,null,null,null,null,null,null,null,null,null,null,null,null,null,null,null,null,null,null,null,null,null,null,null,null,null,null,null,null,null,null,null,null,null,null,null,null,null,null,null,null,null,null,null,null,0,0,0,0,null,999,null,0]
[null,null,null,null,null,null,null,null,null,null,null,null,null,null,null,null,null,null,null,null,null,null,null,null,null,null,null,null,null,null,null,null,null,null,null,null,null,null,null,null,null,null,null,null,null,null,null,null,null,null,null,null,null,null,null,null,null,null,null,null,0,0,0,0,null,999,null,0]
[null,null,null,null,null,null,null,null,null,null,null,null,null,null,null,null,null,null,null,null,null,null,null,null,null,null,null,null,null,null,null,null,null,null,null,null,null,null,null,null,null,null,null,null,null,null,null,null,null,null,null,null,null,null,null,null,null,null,null,null,0,0,0,0,null,999,null,0]
[null,null,null,null,null,null,null,null,null,null,null,null,null,null,null,null,null,null,null,null,null,null,null,null,null,null,null,null,null,null,null,null,null,null,null,null,null,null,null,null,null,null,null,null,null,null,null,null,null,null,null,null,null,null,null,null,null,null,null,null,0,0,0,0,null,999,null,0]
[null,null,null,null,null,null,null,null,null,null,null,null,null,null,null,null,null,null,null,null,null,null,null,null,null,null,null,null,null,null,null,null,null,null,null,null,null,null,null,null,null,null,null,null,null,null,null,null,null,null,null,null,null,null,null,null,null,null,null,null,0,0,0,0,null,999,null,0]
[null,null,null,null,null,null,null,null,null,null,null,null,null,null,null,null,null,null,null,null,null,null,null,null,null,null,null,null,null,null,null,null,null,null,null,null,null,null,null,null,null,null,null,null,null,null,null,null,null,null,null,null,null,null,null,null,null,null,null,null,0,0,0,0,null,999,null,0]
[null,null,null,null,null,null,null,null,null,null,null,null,null,null,null,null,null,null,null,null,null,null,null,null,null,null,null,null,null,null,null,null,null,null,null,null,null,null,null,null,null,null,null,null,null,null,null,null,null,null,null,null,null,null,null,null,null,null,null,null,97.5,170.625,40,79,null,170.625,null,37.220363602009435]
[null,null,null,null,null,null,null,null,null,null,null,null,null,null,null,null,null,null,null,null,null,null,null,null,null,null,null,null,null,null,null,null,null,null,null,null,null,null,null,null,null,null,null,null,null,null,null,null,null,null,null,null,null,null,null,null,null,null,null,null,98.3,172.02500000000001,80,94,null,172.02500000000001,null,74.44072720401887]
[null,null,null,null,null,null,null,null,null,null,null,null,null,null,null,null,null,null,null,null,null,null,null,null,null,null,null,null,null,null,null,null,null,null,null,null,null,null,null,null,null,null,null,null,null,null,null,null,null,null,null,null,null,null,null,null,null,null,null,null,100,175,120,110,null,175,null,111.6610908060283]
[null,null,null,null,null,null,null,null,null,null,null,null,null,null,null,null,null,null,null,null,null,null,null,null,null,null,null,null,null,null,null,null,null,null,null,null,null,null,null,null,null,null,null,null,null,null,null,null,null,null,null,null,null,null,null,null,null,null,null,null,{"$f":"_xlfn.NUMBERVALUE(IF(AND($G387>=($U$151-$Y$151),$G387<=($U$151+$Y$151)),B387,\"\"))","v":0},{"$f":"_xlfn.NUMBERVALUE(IFERROR(+BI560*$W$149,\"\"))","v":0},{"$f":"_xlfn.NUMBERVALUE(IF(AND($G387>=($U$151-$Y$151),$G387<=($U$151+$Y$151)),C387,\"\"))","v":0},{"$f":"_xlfn.NUMBERVALUE(IF(AND($G387>=($U$151-$Y$151),$G387<=($U$151+$Y$151)),G387,\"\"))","v":0},null,{"$f":"IF(BJ560=0,999,BJ560)","v":999},null,{"$f":"+BK560*$BP$172","v":0}]
[null,null,null,null,null,null,null,null,null,null,null,null,null,null,null,null,null,null,null,null,null,null,null,null,null,null,null,null,null,null,null,null,null,null,null,null,null,null,null,null,null,null,null,null,null,null,null,null,null,null,null,null,null,null,null,null,null,null,null,null,0,0,0,0,null,999,null,0]
[null,null,null,null,null,null,null,null,null,null,null,null,null,null,null,null,null,null,null,null,null,null,null,null,null,null,null,null,null,null,null,null,null,null,null,null,null,null,null,null,null,null,null,null,null,null,null,null,null,null,null,null,null,null,null,null,null,null,null,null,0,0,0,0,null,999,null,0]
[null,null,null,null,null,null,null,null,null,null,null,null,null,null,null,null,null,null,null,null,null,null,null,null,null,null,null,null,null,null,null,null,null,null,null,null,null,null,null,null,null,null,null,null,null,null,null,null,null,null,null,null,null,null,null,null,null,null,null,null,0,0,0,0,null,999,null,0]
[null,null,null,null,null,null,null,null,null,null,null,null,null,null,null,null,null,null,null,null,null,null,null,null,null,null,null,null,null,null,null,null,null,null,null,null,null,null,null,null,null,null,null,null,null,null,null,null,null,null,null,null,null,null,null,null,null,null,null,null,0,0,0,0,null,999,null,0]
[null,null,null,null,null,null,null,null,null,null,null,null,null,null,null,null,null,null,null,null,null,null,null,null,null,null,null,null,null,null,null,null,null,null,null,null,null,null,null,null,null,null,null,null,null,null,null,null,null,null,null,null,null,null,null,null,null,null,null,null,100,175,160,88,null,175,null,148.88145440803774]
[null,null,null,null,null,null,null,null,null,null,null,null,null,null,null,null,null,null,null,null,null,null,null,null,null,null,null,null,null,null,null,null,null,null,null,null,null,null,null,null,null,null,null,null,null,null,null,null,null,null,null,null,null,null,null,null,null,null,null,null,93.7,163.97499999999999,0,115,null,163.97499999999999,null,0]
[null,null,null,null,null,null,null,null,null,null,null,null,null,null,null,null,null,null,null,null,null,null,null,null,null,null,null,null,null,null,null,null,null,null,null,null,null,null,null,null,null,null,null,null,null,null,null,null,null,null,null,null,null,null,null,null,null,null,null,null,97.7,170.97499999999999,40,115,null,170.97499999999999,null,37.220363602009435]
[null,null,null,null,null,null,null,null,null,null,null,null,null,null,null,null,null,null,null,null,null,null,null,null,null,null,null,null,null,null,null,null,null,null,null,null,null,null,null,null,null,null,null,null,null,null,null,null,null,null,null,null,null,null,null,null,null,null,null,null,97.8,171.15,80,115,null,171.15,null,74.44072720401887]
[null,null,null,null,null,null,null,null,null,null,null,null,null,null,null,null,null,null,null,null,null,null,null,null,null,null,null,null,null,null,null,null,null,null,null,null,null,null,null,null,null,null,null,null,null,null,null,null,null,null,null,null,null,null,null,null,null,null,null,null,94,164.5,120,115,null,164.5,null,111.6610908060283]
[null,null,null,null,null,null,null,null,null,null,null,null,null,null,null,null,null,null,null,null,null,null,null,null,null,null,null,null,null,null,null,null,null,null,null,null,null,null,null,null,null,null,null,null,null,null,null,null,null,null,null,null,null,null,null,null,null,null,null,null,100,175,160,115,null,175,null,148.88145440803774]
[null,null,null,null,null,null,null,null,null,null,null,null,null,null,null,null,null,null,null,null,null,null,null,null,null,null,null,null,null,null,null,null,null,null,null,null,null,null,null,null,null,null,null,null,null,null,null,null,null,null,null,null,null,null,null,null,null,null,null,null,0,0,0,0,null,999,null,0]
[null,null,null,null,null,null,null,null,null,null,null,null,null,null,null,null,null,null,null,null,null,null,null,null,null,null,null,null,null,null,null,null,null,null,null,null,null,null,null,null,null,null,null,null,null,null,null,null,null,null,null,null,null,null,null,null,null,null,null,null,0,0,0,0,null,999,null,0]
[null,null,null,null,null,null,null,null,null,null,null,null,null,null,null,null,null,null,null,null,null,null,null,null,null,null,null,null,null,null,null,null,null,null,null,null,null,null,null,null,null,null,null,null,null,null,null,null,null,null,null,null,null,null,null,null,null,null,null,null,0,0,0,0,null,999,null,0]
[null,null,null,null,null,null,null,null,null,null,null,null,null,null,null,null,null,null,null,null,null,null,null,null,null,null,null,null,null,null,null,null,null,null,null,null,null,null,null,null,null,null,null,null,null,null,null,null,null,null,null,null,null,null,null,null,null,null,null,null,0,0,0,0,null,999,null,0]
[null,null,null,null,null,null,null,null,null,null,null,null,null,null,null,null,null,null,null,null,null,null,null,null,null,null,null,null,null,null,null,null,null,null,null,null,null,null,null,null,null,null,null,null,null,null,null,null,null,null,null,null,null,null,null,null,null,null,null,null,0,0,0,0,null,999,null,0]
[null,null,null,null,null,null,null,null,null,null,null,null,null,null,null,null,null,null,null,null,null,null,null,null,null,null,null,null,null,null,null,null,null,null,null,null,null,null,null,null,null,null,null,null,null,null,null,null,null,null,null,null,null,null,null,null,null,null,null,null,97.4,170.45,0,109,null,170.45,null,0]
[null,null,null,null,null,null,null,null,null,null,null,null,null,null,null,null,null,null,null,null,null,null,null,null,null,null,null,null,null,null,null,null,null,null,null,null,null,null,null,null,null,null,null,null,null,null,null,null,null,null,null,null,null,null,null,null,null,null,null,null,96.2,168.35,40,109,null,168.35,null,37.220363602009435]
[null,null,null,null,null,null,null,null,null,null,null,null,null,null,null,null,null,null,null,null,null,null,null,null,null,null,null,null,null,null,null,null,null,null,null,null,null,null,null,null,null,null,null,null,null,null,null,null,null,null,null,null,null,null,null,null,null,null,null,null,94.2,164.85,80,109,null,164.85,null,74.44072720401887]
[null,null,null,null,null,null,null,null,null,null,null,null,null,null,null,null,null,null,null,null,null,null,null,null,null,null,null,null,null,null,null,null,null,null,null,null,null,null,null,null,null,null,null,null,null,null,null,null,null,null,null,null,null,null,null,null,null,null,null,null,95.1,166.42500000000001,120,109,null,166.42500000000001,null,111.6610908060283]
[null,null,null,null,null,null,null,null,null,null,null,null,null,null,null,null,null,null,null,null,null,null,null,null,null,null,null,null,null,null,null,null,null,null,null,null,null,null,null,null,null,null,null,null,null,null,null,null,null,null,null,null,null,null,null,null,null,null,null,null,100,175,160,109,null,175,null,148.88145440803774]
[null,null,null,null,null,null,null,null,null,null,null,null,null,null,null,null,null,null,null,null,null,null,null,null,null,null,null,null,null,null,null,null,null,null,null,null,null,null,null,null,null,null,null,null,null,null,null,null,null,null,null,null,null,null,null,null,null,null,null,null,0,0,0,0,null,999,null,0]
[null,null,null,null,null,null,null,null,null,null,null,null,null,null,null,null,null,null,null,null,null,null,null,null,null,null,null,null,null,null,null,null,null,null,null,null,null,null,null,null,null,null,null,null,null,null,null,null,null,null,null,null,null,null,null,null,null,null,null,null,0,0,0,0,null,999,null,0]
[null,null,null,null,null,null,null,null,null,null,null,null,null,null,null,null,null,null,null,null,null,null,null,null,null,null,null,null,null,null,null,null,null,null,null,null,null,null,null,null,null,null,null,null,null,null,null,null,null,null,null,null,null,null,null,null,null,null,null,null,0,0,0,0,null,999,null,0]
[null,null,null,null,null,null,null,null,null,null,null,null,null,null,null,null,null,null,null,null,null,null,null,null,null,null,null,null,null,null,null,null,null,null,null,null,null,null,null,null,null,null,null,null,null,null,null,null,null,null,null,null,null,null,null,null,null,null,null,null,0,0,0,0,null,999,null,0]
[null,null,null,null,null,null,null,null,null,null,null,null,null,null,null,null,null,null,null,null,null,null,null,null,null,null,null,null,null,null,null,null,null,null,null,null,null,null,null,null,null,null,null,null,null,null,null,null,null,null,null,null,null,null,null,null,null,null,null,null,97.5,170.625,0,103,null,170.625,null,0]
[null,null,null,null,null,null,null,null,null,null,null,null,null,null,null,null,null,null,null,null,null,null,null,null,null,null,null,null,null,null,null,null,null,null,null,null,null,null,null,null,null,null,null,null,null,null,null,null,null,null,null,null,null,null,null,null,null,null,null,null,98.8,172.9,50,103,null,172.9,null,46.525454502511792]
[null,null,null,null,null,null,null,null,null,null,null,null,null,null,null,null,null,null,null,null,null,null,null,null,null,null,null,null,null,null,null,null,null,null,null,null,null,null,null,null,null,null,null,null,null,null,null,null,null,null,null,null,null,null,null,null,null,null,null,null,96.4,168.7,100,103,null,168.7,null,93.050909005023584]
[null,null,null,null,null,null,null,null,null,null,null,null,null,null,null,null,null,null,null,null,null,null,null,null,null,null,null,null,null,null,null,null,null,null,null,null,null,null,null,null,null,null,null,null,null,null,null,null,null,null,null,null,null,null,null,null,null,null,null,null,100,175,150,103,null,175,null,139.57636350753538]