{"text_format":"1","workbook":"xlsx","n_sheets":7,"sheets":["Title","Monthly Cost & Use","Farmer Input","ITC1","ITCn","Immediate Tax Bfts. (Lease)","Delay Tax Bfts. (Lease)"],"not_rendered":{"charts":7,"images":4,"macros":1,"external_links":0,"defined_names":201,"comments":3,"pivot_tables":0},"unopened":[],"bounds":{"document_bytes":16777216,"sheet_cells":100000,"rows_first":2000,"rows_last":500,"rows_between":2000,"halvings":0,"cell_chars":16384,"cell_head_chars":4096},"cells_cut":0,"cells_raw":0,"read":"whole","date_system":"1900"}

{"sheet":"Title","index":0,"n_rows":29,"n_cols":9,"rows_kept":29,"cut":false,"hidden":false,"merged":[[18,3,18,14],[28,1,37,16],[19,2,19,15]]}
[]
[]
[]
[]
[]
[]
[]
[]
[]
[]
{"$rows_left_out":20}
{"sheet":"Monthly Cost & Use","index":1,"n_rows":40,"n_cols":29,"rows_kept":40,"cut":false,"hidden":false,"merged":[[1,2,1,3],[1,4,1,5],[1,6,1,7],[35,7,35,13],[39,1,44,23],[37,10,37,16]]}
[]
[null,"Date"," Meter 1",null,"Meter 2",null,"        Combined Meters",null,null,null,null,null,null,null,null,null,null,{"$f":"(INDEX(LINEST(H4:H15-IF(R4>0,R4,0),G4:G15,IF(R4>0,FALSE,TRUE),FALSE),1))","v":0.11706868079157731},"kWh rate - variable in $/kWh",null,null,null,null,null,null,null,null,"  30% Federal Income Tax Credit (2023 trough 2033)",0.3]
[null,"End of ","kWh   ","$    ","kWh    ","$    ","kWh   ","$       ","Est. $     ",null,null,null,null,null,null,null,null,{"$f":"INDEX(LINEST(H4:H15,G4:G15,TRUE,FALSE),2)","v":1419.7420367152013},"estimated access fee",null,null,null,null,null,null,null,null,"  40% Federal Income Tax Credit (2023-33 - Low Income or Indian Lands Provision)",0.4]
[null,"Jan '21",16760,2589.44,null,null,{"$f":"+C4+E4","v":16760},{"$f":"+D4+F4","v":2589.44},{"$f":"+IF($R$4=0,$R$3,$R$4)+G4*$R$2","v":2262.0710900668355},null,null,null,null,null,null,null,null,300,"known access fee (set to zero if you want model to estimate)"]
[null,"Feb '21",17024,2611.2599999999998,null,null,{"$f":"+C5+E5","v":17024},{"$f":"+D5+F5","v":2611.2599999999998},{"$f":"+IF($R$4=0,$R$3,$R$4)+G5*$R$2","v":2292.9772217958121},null,null,null,null,null,null,null,null,{"$f":"SUM(G4:G15)","v":374245},"Total kWh",null,null,null,null,null,null,null,null,2023,0.8]
[null,"Mar '21",34667,4249.5,null,null,34667,4249.5,4358.4199570016108,null,null,null,null,null,null,null,null,null,null,null,null,null,null,null,null,null,null,2024,0.6]
[null,"Apr '21",22395,3512.04,null,null,22395,3512.04,2921.7531063273741,null,null,null,null,null,null,null,null,null,null,null,null,null,null,null,null,null,null,2025,0.4]
[null,"May '21",24287,3771.04,null,null,24287,3771.04,3143.2470503850382,null,null,null,null,null,null,null,null,null,null,null,null,null,null,null,null,null,null,2026,0.2]
[null,"Jun '21",33412,4513.7700000000004,null,null,33412,4513.7700000000004,4211.4987626081811]
[null,"Jul '21",30692,4333.8,null,null,30692,4333.8,3893.071950855091]
{"$rows_left_out":31}
{"sheet":"Farmer Input","index":2,"n_rows":105,"n_cols":53,"rows_kept":105,"cut":false,"hidden":false,"merged":[[18,2,27,3],[64,27,64,38],[95,40,98,52],[2,7,2,8],[0,2,0,9],[0,14,14,17],[29,40,29,52],[31,28,33,28],[32,29,33,29],[29,30,33,30],[3,7,3,8],[22,31,24,35],[25,43,27,49],[29,31,30,38],[31,34,33,34],[31,35,33,35],[70,37,72,37],[31,36,33,36],[81,40,81,52],[99,40,104,52],[31,37,33,37],[31,38,33,38],[42,40,42,52],[55,40,55,52],[68,40,68,52],[38,44,40,45],[70,38,72,38],[71,32,72,32],[12,7,12,8],[104,27,109,38],[68,30,72,30],[32,32,33,32],[31,33,33,33],[18,16,19,16],[25,16,27,16],[13,7,13,8],[70,28,72,28],[71,29,72,29],[68,31,69,38],[70,33,72,33],[70,34,72,34],[70,35,72,35],[70,36,72,36]]}
[true,null,"Please enter input below in the cells highlighted in green.  Graphs will update automatically.  To ensure proper calculations have been performed, you can also push the 'Refresh' button.",null,null,null,null,null,null,null,null,null,null,null,"Disclaimer: The information provided within represents estimates that are a result of a set of complex calculations that are described in more detail in information provided on the download site. Changes in parameter values and its implications on profitability differences are estimates. The user should use their own reasonable judgment to determine whether results are appropriate before acting on the results. As such, this software is provided ‘as is’ and without warranties as to performance of merchantability. Further, statements may have been made to you about this software. Any such statements do not constitute warranties and shall not be relied on by the user in deciding whether to use the program or act on its results. This program is provided without any expressed or implied warranties whatsoever. Because the diversity of conditions and hardware under which this program may be used, no warranty of merchantability or warranty of fitness for a particular purpose is offered. The user is advised to test the program thoroughly before relying on it. The user assumes the entire risk of using the program. The University of Arkansas will not be liable for any claim or damage brought against the user by any third party, nor will the University of Arkansas be liable for any consequential, indirect or special damages suffered by the user as a result of the software.",null,null,null,null,null,"Descriptor"]
["No",null,null," without tracking",null,"with tracking",null,null,null,null,null,null,null,null,null,null,null,null,null,null,"100% Fin. @ 10 yr loan (Scenario 1)"]
["Yes > 500 kW",null,"PVWatts Estimate",1384,null,{"$f":"+D3*1.16","v":1605.4399999999998},null,"Potential Bonus Depreciation",null,{"$f":"+D11*(1-VLOOKUP('Monthly Cost & Use'!H36,'Monthly Cost & Use'!AB2:AC3,2,FALSE)/2)*VLOOKUP('Monthly Cost & Use'!H38,'Monthly Cost & Use'!AB5:AC8,2,FALSE)","v":148021.46893063583},null,null,null,null,null,null,null,null,null,null,"NPV 1yr ITC",34584]
[null,null,"Annual Electiricity Use - kWh",{"$f":"+'Monthly Cost & Use'!R5+D8*IF(D9=\"No\",D3,F3)","v":374245},null,null,null,"Useful Life",null,20,null,null,null,null,null,null,null,null,null,null,"NPV 5yr ITC",31668.39,null,null,null,null,null,{"$f":"+'Monthly Cost & Use'!R5+D8*IF(D9=\"No\",D3,F3)","v":374245}]
["MACRS",null,"Total House Square Ft.",{"$f":"43*500*10","v":215000},null,null,null,"Zip",null,{"$f":"+'Monthly Cost & Use'!H33","v":72727},null,null,null,null,null,null,null,null,null,null,"B/E 1 yr ITC",2.3787148367381317,null,null,null,null,null,{"$f":"+'Monthly Cost & Use'!H33","v":72727}]
["SLN",null,"kWh/1000 sq ft.",{"$f":"+D4/D5*1000","v":1740.6744186046512},null,null,null,"Exp. Elec. Rate  (¢/kWh)",null,{"$f":"+'Monthly Cost & Use'!R2*100","v":11.706868079157731},null,null,null,null,null,null,null,null,null,null,"B/E 5yr ITC",2.7392183435390196,null,null,null,null,null,{"$f":"+'Monthly Cost & Use'!R2*100","v":11.706868079157731}]
[null,null,"Expected kWDC",{"$f":"+(D4)/IF(D9=A2,D3,D3*1.18)","v":270.40823699421964},null,null,null,"Electricity Inflation",null,0.02,null,null,null,null,null,null,null,null,null,null,"Neg. Cash 1 yr",9]
[null,{"$f":"-'Monthly Cost & Use'!R5/IF(D9=\"No\",D3,F3)","v":-270.40823699421964},"Additional kW",0,null,null,null,"O & M Inflation",null,0.01,null,null,null,null,null,null,null,null,null,null,"Neg. Cash 5 yr",5]
[null,null,"Tracker System","No",null,"Grant awarded:",null,"Monthly Est. Base Fee",null,{"$f":"IF('Monthly Cost & Use'!R4>0,'Monthly Cost & Use'!R4,'Monthly Cost & Use'!R3)","v":300},null,null,null,null,null,null,null,null,null,null,"Total Neg Cash 1 yr",-31885.5,null,null,null,null,null,{"$f":"IF('Monthly Cost & Use'!R4>0,'Monthly Cost & Use'!R4,'Monthly Cost & Use'!R3)","v":300}]
[null,null,"Specify REAP (% of Initial Cost)",0.25,null,{"$f":"IF(D10*D11>500000,500000,D10*D11)","v":108839.3153901734},null,"Income Tax Rate (Federal)",null,0.2,null,null,null,null,null,null,null,null,null,null,"Total Neg Cash 5 yr",-16429.12]
{"$rows_left_out":96}
{"sheet":"ITC1","index":3,"n_rows":42,"n_cols":35,"rows_kept":42,"cut":false,"hidden":false,"merged":[[11,5,11,6],[13,5,13,6]]}
[null,null,null,null,null,"Discount Rate",{"$f":"+'Farmer Input'!J14","v":0.06}]
[null,null,"Temp",null,null,"System Size (kW DC)",{"$f":"+'Farmer Input'!D7","v":270.40823699421964},null,{"$f":"+'Farmer Input'!D3","v":1384},"kWh/kw",null,null,"Second Loan",{"$f":"+(N5-'Farmer Input'!F10)*(1-G3)","v":48977.691925578038},null,null,null,null,null,null,null,null,null,null,null,null,null,"(Dep. + Int. + "]
[null,null,{"$f":"+'Farmer Input'!D12","v":0.85},null,null,"Amount Financed (%)",{"$f":"+'Farmer Input'!D12","v":0.85},{"$f":"+AH10","v":96009.559826047611},{"$f":"+I2*1.18","v":1633.12},"with tracking","18% increase ih kWh /w tracking",null,"Equity Amount",{"$f":"N5*(1-G3)","v":65303.589234104053},null,null,null,null,null,"Degradation rate",5.0000000000000001E-3,null,null,null,null,null,"(Dep. + Int. + ","Insc. + O&M +"]
[null,null,null,null,null,"Loan Term (years)",{"$f":"+'Farmer Input'!D13","v":20},null,null,null,null,null,"Monthly Loan Payment",{"$f":"PMT(G5/12,G4*12,N5*G3)","v":-3473.5865716941189},null,null,null,null,null,"property tax",7.4999999999999997E-3,{"$f":"+'Farmer Input'!J4","v":20},"Year Useful life, SLN for BV for Prop. Tax",null,null,null,"Insc. + O&M +","Prop. Tax +"]
[null,null,null,null,null,"Debt Financing Rate",{"$f":"+'Farmer Input'!D14","v":9.6000000000000002E-2},null,null,null,null,null,"Purchase Price",{"$f":"VLOOKUP(G2,F16:G23,2,TRUE)*G2*1000*(IF(G10='Farmer Input'!A3,1.1,1))","v":435357.26156069362},"10% increase in cost per kW with tracking",null,null,null,null,"insurance at ",5.4999999999999997E-3,null,null,null,null,"Fin. + Insc. + ","Prop. Tax +","Rem. Elec. Bill"]
[null,null,null,null,null,"Electric Inflation Rate",{"$f":"+'Farmer Input'!J7","v":0.02},null,null,null,null,null,"Bonus Depreciation",{"$f":"+'Farmer Input'!J3","v":148021.46893063583},null,null,null,null,null,"maintenance",{"$f":"IF('Farmer Input'!D9='Farmer Input'!A2,0.005,0.005*1.1)","v":5.0000000000000001E-3},"increase of 10% with tracking",null,null,null,"O&M + Prop.","Rem. Elec. Bill)","- State Tax)"]
[null,null,null,null,null,"O&M Inflation Rate",{"$f":"+'Farmer Input'!J8","v":0.01},null,null,null,null,null,null,{"$f":"SUM(N10:N39)/N5","v":0.85},null,null,null,null,null,null,null,null,null,null,null,"Tax + Rem. Electric","* State T Rate","* Fed T Rate"]
[null,null,null,null,null,"Federal Tax Rate",{"$f":"+'Farmer Input'!J10","v":0.2},null,"Year","Annual Net After Tax Cash","Discounted Annual Value","Discounted Payback","Income Tax Credit on Initial Cost less Grants Awarded (ITC)","Depreciation","Panel Output (Degredation)","kWh Annual","Electric Rate","Solar Value (SP)","Interest Expense (I)","Maintenance & Insurance (M&I)","Inverter Replacement (IV)","Debt Service [principal (P) only]","Est. Electric Bill Without System","Remaining Electricity Bill (REB)","Property Taxes (PT)","Pre-Tax Cashflow","State Tax Savings","Federal Tax Savings","After-Tax Solar Savings","Est. Yearly After Tax Net Cashflow with Solar (CFAT, S+)","Income Tax Savings (ITS)","Payback","Est. After Tax Electric Bill without Solar (CFAT,S-)","Difference in After Tax Cashflow","Neg Cashflow Years"]
[null,null,null,null,null,"State Tax Rate",{"$f":"+'Farmer Input'!J11","v":0.05},null,0,{"$f":"-'Farmer Input'!F12","v":-48977.691925578038},{"$f":"J9","v":-48977.691925578038},null,null,null,null,null,null,null,null,null,null,null,null,null,null,null,null,null,null,{"$f":"+'Farmer Input'!F10","v":108839.3153901734},null,null,null,{"$f":"+AD9-AG9","v":108839.3153901734},{"$f":"NPV(G1,AI10:AI39)","v":-2823.5595673221469}]
[null,null,"Temp Discount",null,null,"Tracker?",{"$f":"+'Farmer Input'!D9","v":"No"},null,1,{"$f":"N10+R10+T10+U10+V10+S10","v":149193.82744743419},{"$f":"+J10*(1+$G$1)^-I10","v":140748.89381833412},{"$f":"IF(+K10+$J$9>0,I10+(K10+$J$9)/$J$9,\"na\")","v":-0.87373472053773171},{"$f":"(N5-'Farmer Input'!F10)*VLOOKUP('Monthly Cost & Use'!H36,'Monthly Cost & Use'!AB2:AC3,2,FALSE)","v":97955.383851156061},{"$f":"IF('Farmer Input'!$J$13=\"MACRS\",((1-VLOOKUP('Monthly Cost & Use'!H36,'Monthly Cost & Use'!AB2:AC3,2,FALSE)/2)*$N$5-N6)*0.2,IF(I10<='ITC1'!$V$4,((1-VLOOKUP('Monthly Cost & Use'!H36,'Monthly Cost & Use'!AB2:AC3,2,FALSE)/2)*$N$5-N6)/'ITC1'!$V$4,0))+N6","v":192427.90960982657},1,{"$f":"IF(G10=\"No\",G2*$I$2,G2*$I$3)","v":374245},{"$f":"G11/100","v":0.11706868079157731},{"$f":"P10*Q10*$G$13","v":43812.36844284385},{"$f":"IFERROR(CUMIPMT($G$5/12,$G$4*12,($N$5-'Farmer Input'!$F$10)*$G$3,I10*12-11,I10*12,0),0)-$N$2*'Farmer Input'!G12","v":-30402.329463890874},{"$f":"-$G$2*1000*SUM($U$5:$U$6)","v":-2839.2864884393061},null,{"$f":"IF(I10<=G$4,IFERROR(CUMPRINC($G$5/12,$G$4*12,($N$5-'Farmer Input'!$F$10)*$G$3,I10*12-11,I10*12,0),0),0)-$N$2","v":-53804.834652906058},{"$f":"-'Farmer Input'!$D$4*'Monthly Cost & Use'!$R$2*(1+$G$6)^I9-12*'Farmer Input'!$J$9*(1+'Farmer Input'!$J$7)^I10","v":-47484.36844284385},{"$f":"W10+R10","v":-3672},{"$f":"-IF(($N$5-SLN($N$5,0,$V$4)*I10)*$U$4<0,0,($N$5-SLN($N$5,0,$V$4)*I10)*$U$4)","v":-3101.9204886199423},{"$f":"+Y10+V10+U10+T10+S10+X10","v":-93820.371093856185},{"$f":"(+Y10+U10+T10+S10+X10-N10)*-$G$9","v":11622.172302538835},{"$f":"(AA10+Y10+U10+T10+S10+X10-N10)*-$G$8","v":44164.254749647574},{"$f":"+R10*(1-($G$9+(1-$G$9)*$G$8))","v":33297.400016561325},{"$f":"+Z10+AA10+AB10+M10","v":59921.439809486285},{"$f":"+AA10+AB10","v":55786.427052186409},{"$f":"IF(+AD10-$N$5>0,I10+(AD10-$N$5)/$N$5,\"na\")","v":"na"},{"$f":"+W10*(1-($G$9+(1-$G$9)*$G$8))","v":-36088.120016561326},{"$f":"+AD10-AG10","v":96009.559826047611},{"$f":"IF(AH10<0,AH10,0)","v":0}]
{"$rows_left_out":33}
{"sheet":"ITCn","index":4,"n_rows":42,"n_cols":35,"rows_kept":42,"cut":false,"hidden":false,"merged":[[11,5,11,6],[13,5,13,6]]}
[null,null,null,null,null,"Discount Rate",{"$f":"+'Farmer Input'!J14","v":0.06}]
[null,null,"Temp",null,null,"System Size (kW DC)",{"$f":"+'Farmer Input'!D7","v":270.40823699421964},null,{"$f":"+'Farmer Input'!D3","v":1384},"kWh/kw","kWh/kw",null,"Second Loan",{"$f":"+(N5-'Farmer Input'!F10)*(1-G3)","v":48977.691925578038}]
[null,null,{"$f":"+'Farmer Input'!D12","v":0.85},null,null,"Amount Financed (%)",{"$f":"+'Farmer Input'!D12","v":0.85},null,{"$f":"+I2*1.18","v":1633.12},"with tracking","with tracking","18% increase ih kWh /w tracking","Equity Amount",{"$f":"N5*(1-G3)","v":65303.589234104053},null,null,null,null,null,null,null,null,null,null,null,null,null,"(Dep. + Int. + "]
[null,null,null,null,null,"Loan Term (years)",{"$f":"+'Farmer Input'!D13","v":20},null,null,null,null,null,"Monthly Loan Payment",{"$f":"PMT(G5/12,G4*12,N5*G3)","v":-3473.5865716941189},null,null,null,null,null,null,null,null,null,null,null,null,"(Dep. + Int. + ","Insc. + O&M +"]
[null,null,null,null,null,"Debt Financing Rate",{"$f":"+'Farmer Input'!D14","v":9.6000000000000002E-2},null,null,null,null,null,"Purchase Price",{"$f":"VLOOKUP(G2,F16:G23,2,TRUE)*G2*1000*(IF(G10='Farmer Input'!A3,1.1,1))","v":435357.26156069362},"10% increase in cost per kW with tracking",null,null,null,null,null,null,null,null,null,null,"Fin. + Insc. + ","Insc. + O&M +","Prop. Tax"]
[null,null,null,null,null,"Electric Inflation Rate",{"$f":"+'Farmer Input'!J7","v":0.02},null,null,null,null,null,null,null,null,null,null,null,null,null,null,null,null,null,null,"O&M + Prop.","Prop. Tax)","- State Tax)"]
[null,null,null,null,null,"O&M Inflation Rate",{"$f":"+'Farmer Input'!J8","v":0.01},null,null,null,null,null,null,null,null,null,null,null,null,null,null,null,null,null,null,"Tax","* State T Rate","* Fed T Rate"]
[null,null,null,null,null,"Federal Tax Rate",{"$f":"+'Farmer Input'!J10","v":0.2},null,"Year","Annual Net After Tax Cash","Discounted Annual Value","Discounted Payback","ITC","Depreciation","Panel Output (Degredation)","kWh Annual","Electric Rate","Pre-Tax Solar Value","Interest Expense","Maintenance & Insurance","Inverter Replacement","Debt Service (principal only)","Est. Electric Bill Without System","Est. Electric Bill With System","Property Taxes","Pre-Tax Cashflow","State Tax Savings","Federal Tax Savings","After-Tax Solar Savings","Est. Yearly After Tax Net Cashflow with Solar","Income Tax Savings","Payback","Est. After Tax Electric Bill without Solar","Difference in After Tax Cashflow","Neg Cashflow Years"]
[null,null,null,null,null,"State Tax Rate",{"$f":"+'Farmer Input'!J11","v":0.05},null,0,{"$f":"-N5*(1-G3)","v":-65303.589234104053},{"$f":"+J9","v":-65303.589234104053},null,null,null,null,null,null,null,null,null,null,null,null,null,null,null,null,null,null,{"$f":"+'Farmer Input'!F10","v":108839.3153901734},null,null,null,{"$f":"+AD9-AG9","v":108839.3153901734},{"$f":"NPV(G1,AI10:AI39)","v":-2823.5595673221469}]
[null,null,null,null,null,"Tracker?",{"$f":"+'Farmer Input'!D9","v":"No"},null,1,{"$f":"N10+R10+T10+U10+V10+S10","v":71776.29754364831},{"$f":"+J10*(1+$G$1)^-I10","v":67713.488248724811},{"$f":"IF(+K10+$J$9>0,I10+(K10+$J$9)/$J$9,\"na\")","v":0.96309698987628978},{"$f":"IF(IF('Farmer Input'!$J$12<22,'Farmer Input'!$J$12,22)>=I10,(($N$5-'Farmer Input'!$F$10)*VLOOKUP('Monthly Cost & Use'!$H$36,'Monthly Cost & Use'!$AB$2:$AC$3,2,FALSE))/(IF('Farmer Input'!$J$12<23,'Farmer Input'!$J$12,22)),0)","v":19591.076770231211},{"$f":"IF('Farmer Input'!$J$13=\"MACRS\",(1-VLOOKUP('Monthly Cost & Use'!H36,'Monthly Cost & Use'!AB2:AC3,2,FALSE)/2)*$N$5*0.2,IF(I10<='ITC1'!$V$4,(1-VLOOKUP('Monthly Cost & Use'!H36,'Monthly Cost & Use'!AB2:AC3,2,FALSE)/2)*$N$5/'ITC1'!$V$4,0))","v":74010.734465317917},1,{"$f":"IF(G10=\"No\",G2*$I$2,G2*$I$3)","v":374245},{"$f":"G11/100","v":0.11706868079157731},{"$f":"P10*Q10*$G$13","v":43812.36844284385},{"$f":"IFERROR(CUMIPMT($G$5/12,$G$4*12,($N$5-'Farmer Input'!$F$10)*$G$3,I10*12-11,I10*12,0),0)+IFERROR(CUMIPMT('Farmer Input'!$G$12/12,'Farmer Input'!$J$12*12,$N$2,I10*12-11,I10*12,0),0)","v":-30099.378004884675},{"$f":"-$G$2*1000*SUM('ITC1'!U5:U6)","v":-2839.2864884393061},null,{"$f":"IFERROR(CUMPRINC($G$5/12,$G$4*12,($N$5-'Farmer Input'!$F$10)*$G$3,I10*12-11,I10*12,0),0)+IFERROR(CUMPRINC('Farmer Input'!G$12/12,'Farmer Input'!$J$12*12,$N$2,I10*12-11,I10*12,0),0)","v":-13108.140871189466},{"$f":"-'Farmer Input'!$D$4*'Monthly Cost & Use'!$R$2*(1+$G$6)^I9-12*'Farmer Input'!$J$9*(1+'Farmer Input'!$J$7)^I10","v":-47484.36844284385},{"$f":"W10+R10","v":-3672},{"$f":"-IF(($N$5-SLN($N$5,0,'ITC1'!$V$4)*I10)*'ITC1'!$U$4<0,0,($N$5-SLN($N$5,0,'ITC1'!$V$4)*I10)*'ITC1'!$U$4)","v":-3101.9204886199423},{"$f":"+Y10+V10+U10+T10+S10+X10","v":-52820.725853133394},{"$f":"(+Y10+U10+T10+S10+X10-N10)*-$G$9","v":5686.1659723630919},{"$f":"(AA10+Y10+U10+T10+S10+X10-N10)*-$G$8","v":21607.43069497975},{"$f":"+R10*(1-($G$9+(1-$G$9)*$G$8))","v":33297.400016561325},{"$f":"+Z10+AA10+AB10+M10","v":-5936.0524155593375},{"$f":"+AA10+AB10","v":27293.596667342841},{"$f":"IF(+AD10-$N$5>0,I10+(AD10-$N$5)/$N$5,\"na\")","v":"na"},{"$f":"+W10*(1-($G$9+(1-$G$9)*$G$8))","v":-36088.120016561326},{"$f":"+AD10-AG10","v":30152.067601001989},{"$f":"IF(AH10<0,AH10,0)","v":0}]
{"$rows_left_out":33}
{"sheet":"Immediate Tax Bfts. (Lease)","index":5,"n_rows":39,"n_cols":48,"rows_kept":39,"cut":false,"hidden":true,"merged":[[1,15,1,16],[17,0,19,3],[15,5,15,6],[17,5,17,6],[1,12,1,13]]}
[null,null,null,null,null,"Discount rate",0.05]
[null,null,null,null,null,"System Size (kW DC)",192,null,null,null,null,null,"IRR Without Purchase",null,null,"IRR With Purchase",null,null,null,null,null,null,null,null,null,null,null,null,null,null,null,null,null,null,null,null,null,null,null,null,null,null,null,null,null,null,null,"Yes"]
[null,null,null,null,null,"Tax Credit Value (%)",0.26,null,null,null,null,null,"Equity Amount",{"$f":"N5*(1-G4)","v":244800},null,"Equity Amount",{"$f":"Q5*(1-G4)","v":244800},null,null,null,null,null,null,null,null,null,null,null,null,null,null,null,null,null,null,null,null,null,null,null,null,null,null,null,null,null,null,"No"]
[null,null,null,null,null,"Amount Financed (%)",0.25,null,null,null,null,null,"Monthly Loan Payment",{"$f":"PMT(G6/12,G5*12,N5*G4)","v":-645.28759942110037},null,"Monthly Loan Payment",{"$f":"PMT(G6/12,G5*12,Q5*G4)","v":-645.28759942110037}]
[null,null,null,null,null,"Loan Term (years)",15,null,null,null,null,null,"Purchase Price",{"$f":"VLOOKUP(G2,F20:G27,2,TRUE)*G2*1000","v":326400},null,"Purchase Price",{"$f":"VLOOKUP(G2,F20:G27,2,TRUE)*G2*1000","v":326400}]
[null,null,null,null,null,"Debt Financing Rate",0.05,null,null,null,null,null,"IRR",{"$f":"IRR(M9:M39)","v":0.13427325767198317},null,"IRR",{"$f":"IRR(J9:INDIRECT(\"J\"&G13+9&\"\"))","v":0.13412967264343845}]
[null,null,null,null,null,"O&M Inflation Rate",0.01,null,null,null,null,null,"Discounted Payback",{"$f":"SUM(L10:L39)","v":7.9781299205648875}]
[null,null,null,null,null,"Federal Tax Rate",0.3,null,"Year","Annual Value with Sale","Discounted Annual Value","Discounted Payback","Annual Value","Maximum Depreciation & ITC","Actual Tax Benefits","System Sale","Panel Output (Degredation)","kWh Annual","Effective Lease Rate","Solar Revenue","Sales Tax","Interest Expense","Maintenance & Insurance","Inverter Replacement","Debt Service"]
[null,null,null,null,null,"State Tax Rate",5.8999999999999997E-2,"*",0,{"$f":"-N5*(1-G4)","v":-244800},{"$f":"+J9","v":-244800},null,{"$f":"-N5*(1-G4)","v":-244800},null,null,{"$f":"IF(I9>=G$13,G$15,0)","v":0}]
[null,null,null,null,null,"Tracker?","No",null,1,{"$f":"IF(SUM(P$9:P9)>0,0,IF(P10=0,O10+P10+T10+U10+V10+W10+X10+Y10,P10))","v":185348.6448069468},{"$f":"+J10*(1+$G$1)^-I10","v":176522.51886375886},{"$f":"IF(+K10+$J$9>0,I10+(K10+$J$9)/$J$9,\"na\")","v":"na"},{"$f":"O10+T10+U10+V10+W10+X10+Y10","v":185348.6448069468},{"$f":"N5*G3+N5*0.87*G8+N5*0.2*G9","v":173905.91999999998},{"$f":"N10","v":173905.91999999998},{"$f":"IF(I10=G$13,G$15,0)","v":0},1,{"$f":"IF(G10=\"No\",G2*1510,G2*1700)","v":289920},{"$f":"G11","v":0.08},{"$f":"R10*S10","v":23193.600000000002},{"$f":"T10*-0.09","v":-2087.424},{"$f":"IF(I10<=G$5,IFERROR(CUMIPMT($G$6/12,$G$5*12,$N$5*$G$4,I10*12-11,I10*12,0),0),0)","v":-3994.8688763791715},{"$f":"IF(G10=\"No\",-G2*1000*0.01,-G2*1000*0.015)","v":-1920},null,{"$f":"IF(I10<=G$5,IFERROR(CUMPRINC($G$6/12,$G$5*12,$N$5*$G$4,I10*12-11,I10*12,0),0),0)","v":-3748.5823166740329}]
{"$rows_left_out":30}
{"sheet":"Delay Tax Bfts. (Lease)","index":6,"n_rows":39,"n_cols":47,"rows_kept":39,"cut":false,"hidden":true,"merged":[[1,12,1,13],[1,15,1,16],[15,5,15,6],[17,5,17,6]]}
[]
[null,null,null,null,null,"System Size (kW DC)",192,null,null,null,null,null,"IRR Without Purchase",null,null,"IRR With Purchase",null,null,null,null,null,null,null,null,null,null,null,null,null,null,null,null,null,null,null,null,null,null,null,null,null,null,null,null,null,null,"Yes"]
[null,null,null,null,null,"Tax Credit Value (%)",0.26,null,null,null,null,null,"Equity Amount",{"$f":"N5*(1-G4)","v":326400},null,"Equity Amount",{"$f":"Q5*(1-G4)","v":326400},null,null,null,null,null,null,null,null,null,null,null,null,null,null,null,null,null,null,null,null,null,null,null,null,null,null,null,null,null,"No"]
[null,null,null,null,null,"Amount Financed (%)",0,null,null,null,null,null,"Monthly Loan Payment",{"$f":"PMT(G6/12,G5*12,N5*G4)","v":0},null,"Monthly Loan Payment",{"$f":"PMT(G6/12,G5*12,Q5*G4)","v":0}]
[null,null,null,null,null,"Loan Term (years)",25,null,null,null,null,null,"Purchase Price",{"$f":"VLOOKUP(G2,F20:G27,2,TRUE)*G2*1000","v":326400},null,"Purchase Price",{"$f":"VLOOKUP(G2,F20:G27,2,TRUE)*G2*1000","v":326400}]
[null,null,null,null,null,"Debt Financing Rate",3.5000000000000003E-2,null,null,null,null,null,"IRR",{"$f":"IRR(M9:M39)","v":4.5078479476139632E-2},null,"IRR",{"$f":"IRR(J9:INDIRECT(\"J\"&G13+9&\"\"))","v":4.461432382202335E-2}]
[null,null,null,null,null,"O&M Inflation Rate",0.01,null,null,null,null,null,"Discounted Payback",{"$f":"SUM(L10:L39)","v":16.973862538610632}]
[null,null,null,null,null,"Federal Tax Rate",0.3,null,"Year","Annual Value with Sale","Discounted Annual Value","Discounted Payback","Annual Value","Maximum Depreciation & ITC","Actual Tax Benefits","System Sale","Panel Output (Degredation)","kWh Annual","Effective Lease Rate","Solar Revenue","Sales Tax","Interest Expense","Maintenance & Insurance","Inverter Replacement","Debt Service"]
[null,null,null,null,null,"State Tax Rate",5.8999999999999997E-2,"*",0,{"$f":"-N5*(1-G4)","v":-326400},{"$f":"+J9","v":-326400},null,{"$f":"-N5*(1-G4)","v":-326400},null,null,{"$f":"IF(I9=G$13,G$15,0)","v":0}]
[null,null,null,null,null,"Tracker?","No",null,1,{"$f":"IF(SUM(P$9:P9)>0,0,IF(P10=0,O10+P10+T10+U10+W10+X10+Y10,P10))","v":19797.398399999998},{"$f":"+J10*(1+$G$1)^-I10","v":19797.398399999998},{"$f":"IF(+K10+$J$9>0,I10+(K10+$J$9)/$J$9,\"na\")","v":"na"},{"$f":"O10+T10+U10+W10+X10+Y10","v":19797.398399999998},{"$f":"N5*G3+N5*0.87*G8+N5*0.2*G9","v":173905.91999999998},{"$f":"IF(SUM(T10:W10)*G8<N10,SUM(T10:W10)*G8,0)","v":4568.6304},0,1,{"$f":"IF(G10=\"No\",G2*1510,G2*1700)","v":289920},{"$f":"G11","v":6.5000000000000002E-2},{"$f":"R10*S10","v":18844.8},{"$f":"T10*-0.09","v":-1696.0319999999999},{"$f":"IF(I10<=G$5,IFERROR(CUMIPMT($G$6/12,$G$5*12,$N$5*$G$4,I10*12-11,I10*12,0),0),0)","v":0},{"$f":"IF(G10=\"No\",-G2*1000*0.01,-G2*1000*0.015)","v":-1920},null,{"$f":"IF(I10<=G$5,N$4*12,0)","v":0}]
{"$rows_left_out":29}