{"text_format":"1","workbook":"xlsx","n_sheets":7,"sheets":["Calculate","Saved1","Saved2","SavedTemp","Compare","Defaults","Machinery"],"not_rendered":{"charts":0,"images":14,"macros":1,"external_links":1,"defined_names":35,"comments":2,"pivot_tables":0},"unopened":[],"bounds":{"document_bytes":16777216,"sheet_cells":100000,"rows_first":2000,"rows_last":500,"rows_between":2000,"halvings":0,"cell_chars":16384,"cell_head_chars":4096},"cells_cut":0,"cells_raw":0,"read":"whole","date_system":"1900"}

{"sheet":"Calculate","index":0,"n_rows":50,"n_cols":33,"rows_kept":50,"cut":false,"hidden":false,"merged":[[0,2,0,6],[41,1,45,12],[2,0,2,14],[1,2,1,3],[1,30,2,30],[1,16,2,16],[1,5,1,6],[1,22,2,22],[18,7,19,13],[5,11,6,11],[5,12,6,12],[4,1,5,1],[7,5,8,5],[5,13,6,13],[4,12,4,13],[4,3,5,3],[4,4,5,4],[4,2,5,2],[7,2,8,2],[14,22,14,23],[5,7,6,7],[5,8,6,8],[4,7,4,11],[5,9,6,9],[5,10,6,10],[15,22,15,23],[4,19,5,19],[7,16,8,16],[7,17,8,17],[7,18,8,18],[7,19,8,19],[4,16,5,16],[4,17,5,17],[4,18,5,18],[41,25,42,25],[41,23,42,23],[41,24,42,24],[7,1,8,1],[7,3,8,3],[7,4,8,4],[7,20,8,20],[8,22,8,23],[7,22,7,23],[13,22,13,23],[12,22,12,23],[11,22,11,23],[10,22,10,23],[19,22,19,23],[41,22,42,22],[35,1,35,4],[32,1,32,4],[29,1,29,4],[20,7,20,8],[21,7,21,8],[22,7,22,8],[23,7,23,8],[25,1,26,4],[25,7,26,12]]}
[null,null,"Operating Scenarios"]
[null,null,"Default Saved",null,null,"Sample",null,null,null,null,null,null,null,null,null,null,null,null,null,null,null,null,true,"Saved Match Counter  ",{"$f":"IF(OR(Saved1!Y2=0,Saved2!Y2=0),0,1)","v":0},null,null,null,null,null,5]
["Pasture Aeration and Fertilization Payoff Calculator",null,null,null,null,null,null,null,null,null,null,null,null,null,null,null,null,null,null,null,null,null,null,null,{"$f":"IF(Saved1!Y2=0,Saved1!C2,IF(Saved2!Y2=0,Saved2!F2))","v":"Sample"}]
[]
[null,"Tractor","Purchase \nPrice","Hours at\nPurchase","Expected\nAnnual Use",null,null,"Benchmark Operation (before aeration &/or gypsum application)",null,null,null,null,"After aeration &/or gypsum application",null,null,null,"Tractor","Purchase Price","Hours @\nPurchase","Expected Annual Use",null,null,"Defaults",null,null,null,null,null,null,null,"Expected Yield Increase","Calculated BE Yield Increase","BE Yield with other values at 0"]
[null,null,null,null,null,null,null,"Operation/\n   Operating Input","Unit","# of Trips/\n           App. Rate","Unit Cost","Total Cost\n($/acre)","# of Trips/\n              App. Rate","Total Cost\n($/acre)",null,null,null,null,null,null,null,null,"Operation/\n   Operating Input",null,"Unit","# of trips/\nQuantity","Unit Cost",null,null,null,0.05,5.3114997133036815E-2]
[null,"2 WD 50",32200,0,600,null,null,null,null,null,null,null,null,null,null,null,{"$f":"B7","v":"2 WD 50"},{"$f":"VLOOKUP(Q7,Defaults!$B$22:$C$29,2,FALSE)","v":32200},{"$f":"VLOOKUP(Q7,Defaults!$B$22:$D$29,3,FALSE)","v":0},{"$f":"VLOOKUP(B7,Defaults!$B$22:$L$29,11,FALSE)","v":600}]
[null,"Implement                    Rent","Width","Speed (mph)","Purchase Price/\nRental Rate","Hours @\nPurchase",null,"Fertilizer Spreader",null,1,null,{"$f":"IF(Q14=TRUE,(E10/C16)*J8+Machinery!$AM$3,Machinery!$AM$3)","v":1.2},{"$f":"+J8+IF(M12>0,1,0)","v":2},{"$f":"IF(Q14=TRUE,(E10/C16)+Machinery!$AM$6,Machinery!$AM$6)*M8","v":2.4},null,null,"Implement","Width (ft)","Speed (mph)","Purchase Price","Hours @\nPurchase",null,"Fertilizer Spreader",null,null,{"$f":"Defaults!$E$5","v":1},{"$f":"\"\"","v":""},null,null,null,"Expected N&P Runoff Reduction","Calculated BE N&P Runoff Reduction","BE N&P with other values at 0"]
[null,null,null,null,null,null,null,"Urea [46-0-0]","lb",65,0.15,{"$f":"J9*K9","v":9.75},{"$f":"J9*IF(OR(M15=0,M15=\"\"),1,(1-B32))","v":64.674999999999997},{"$f":"M9*K9","v":9.7012499999999999},null,null,null,null,null,null,null,null,"Urea [46-0-0]",null,"lb",{"$f":"Defaults!$E$6","v":200},{"$f":"Defaults!F6","v":0.15},null,null,null,5.0000000000000001E-3,-0.1209262942515129]
[null,"Fertilizer Spreader Rental","40 ft",7,0,null,null,"Triple Superphosphate [0-45-0]","lb",0,0.22,0,{"$f":"J10*IF(OR(M15=0,M15=\"\"),1-IF(OR(M12=0,M12=\"\"),0,B35),1-B32-IF(OR(M12=0,M12=\"\"),0,B35))","v":0},{"$f":"M10*K10","v":0},null,null,{"$f":"B10","v":"Fertilizer Spreader Rental"},"40 ft",{"$f":"VLOOKUP(R10,Defaults!$C$32:$I$32,7,FALSE)","v":7},{"$f":"IF(Q14=TRUE,Defaults!C42,VLOOKUP(R10,Defaults!$C$32:$D$32,2,FALSE))","v":0},{"$f":"IF(Q14=TRUE,\"\",0)","v":""},null,"Triple Superphosphate [0-45-0]",null,"lb",{"$f":"Defaults!$E$7","v":110},{"$f":"Defaults!F7","v":0.22}]
{"$rows_left_out":41}
{"sheet":"Saved1","index":1,"n_rows":39,"n_cols":50,"rows_kept":39,"cut":false,"hidden":false,"merged":[[20,7,20,8],[21,7,21,8],[22,7,22,8],[23,7,23,8],[7,1,8,1],[7,2,8,2],[7,3,8,3],[7,4,8,4],[7,5,8,5],[4,1,5,1],[4,2,5,2],[4,3,5,3],[4,4,5,4],[4,7,4,11],[5,7,6,7],[5,8,6,8],[5,9,6,9],[5,10,6,10],[5,13,6,13],[21,32,21,33],[22,32,22,33],[23,32,23,33],[4,12,4,13],[5,12,6,12]]}
[]
[null,null,"Default Saved",null,null,null,null,null,null,null,null,null,null,null,null,null,null,null,null,null,null,null,null,"saved match counter",{"$f":"SUM(AA2:AX35)","v":14},null,null,{"$f":"IF(C2=Calculate!C2,0,1)","v":0}]
[]
[]
[null,{"$f":"Calculate!B5","v":"Tractor"},{"$f":"Calculate!C5","v":"Purchase \nPrice"},{"$f":"Calculate!D5","v":"Hours at\nPurchase"},{"$f":"Calculate!E5","v":"Expected\nAnnual Use"},null,null,"Benchmark Operation (before aeration)",null,null,null,null,"After Aeration"]
[null,null,null,null,null,null,null,"Operation/\n   Operating Input","Unit","# of Trips/\nApplication Rate","Unit Cost",null,"# of Trips/\nApplication Rate","Total Cost\n($/acre)"]
[null,"MFWD 50",39100,0,600,null,null,null,null,null,null,null,null,null,null,null,null,null,null,null,null,null,null,null,null,null,{"$f":"IF(B7=Calculate!B7,0,1)","v":1},{"$f":"IF(C7=Calculate!C7,0,1)","v":1},{"$f":"IF(D7=Calculate!D7,0,1)","v":0},{"$f":"IF(E7=Calculate!E7,0,1)","v":0}]
[null,{"$f":"Calculate!B8","v":"Implement                    Rent"},{"$f":"Calculate!C8","v":"Width"},{"$f":"Calculate!D8","v":"Speed (mph)"},"Purchase Price/\nRental Rate",{"$f":"Calculate!F8","v":"Hours @\nPurchase"},null,"Fertilizer Spreader",null,1,null,null,{"$f":"+J8+IF(M12>0,1,0)","v":2},5.82,null,null,false,"<< Modified Fert trips",null,null,null,null,null,null,null,null,null,null,null,null,null,null,null,null,{"$f":"IF(J8=Calculate!J8,0,1)","v":0}]
[null,null,null,null,null,null,null,"Urea [46-0-0]","lb",200,0.15,null,{"$f":"J9*IF(OR(M15=0,M15=\"\"),1,(1-B32))","v":199},{"$f":"M9*K9","v":29.849999999999998},null,null,null,null,null,null,null,null,null,null,null,null,null,null,null,null,null,null,null,null,{"$f":"IF(J9=Calculate!J9,0,1)","v":1},{"$f":"IF(K9=Calculate!K9,0,1)","v":0}]
[null,"Fertilizer Spreader","40 ft",7,11800,0,null,"Triple Superphosphate [0-45-0]","lb",110,0.22,null,{"$f":"J10*IF(OR(M15=0,M15=\"\"),1-IF(OR(M12=0,M12=\"\"),0,B35),1-B32-IF(OR(M12=0,M12=\"\"),0,B35))","v":108.9},{"$f":"M10*K10","v":23.958000000000002},null,null,null,null,null,null,null,null,null,null,null,null,null,{"$f":"IF(C10=Calculate!C10,0,1)","v":0},{"$f":"IF(D10=Calculate!D10,0,1)","v":0},{"$f":"IF(E10=Calculate!E10,0,1)","v":1},{"$f":"IF(F10=Calculate!F10,0,1)","v":0},null,null,null,{"$f":"IF(J10=Calculate!J10,0,1)","v":1},{"$f":"IF(K10=Calculate!K10,0,1)","v":0}]
{"$rows_left_out":30}
{"sheet":"Saved2","index":2,"n_rows":39,"n_cols":50,"rows_kept":39,"cut":false,"hidden":false,"merged":[[7,1,8,1],[7,2,8,2],[22,7,22,8],[23,7,23,8],[7,3,8,3],[7,4,8,4],[7,5,8,5],[20,7,20,8],[21,7,21,8],[4,1,5,1],[4,2,5,2],[4,3,5,3],[4,4,5,4],[4,7,4,11],[5,7,6,7],[5,8,6,8],[5,9,6,9],[5,10,6,10],[5,13,6,13],[21,32,21,33],[22,32,22,33],[23,32,23,33],[4,12,4,13],[5,12,6,12]]}
[]
[null,null,null,null,null,"Sample",null,null,null,null,null,null,null,null,null,null,null,null,null,null,null,null,null,"saved match counter",{"$f":"SUM(AA2:AX35)","v":0},null,null,{"$f":"IF(F2=Calculate!F2,0,1)","v":0}]
[]
[]
[null,{"$f":"Calculate!B5","v":"Tractor"},{"$f":"Calculate!C5","v":"Purchase \nPrice"},{"$f":"Calculate!D5","v":"Hours at\nPurchase"},{"$f":"Calculate!E5","v":"Expected\nAnnual Use"},null,null,"Benchmark Operation (before aeration)",null,null,null,null,"After Aeration"]
[null,null,null,null,null,null,null,"Operation/\n   Operating Input","Unit","# of Trips/\nApplication Rate","Unit Cost",null,"# of Trips/\nApplication Rate","Total Cost\n($/acre)"]
[null,"2 WD 50",32200,0,600,null,null,null,null,null,null,null,null,null,null,null,null,null,null,null,null,null,null,null,null,null,{"$f":"IF(B7=Calculate!B7,0,1)","v":0},{"$f":"IF(C7=Calculate!C7,0,1)","v":0},{"$f":"IF(D7=Calculate!D7,0,1)","v":0},{"$f":"IF(E7=Calculate!E7,0,1)","v":0}]
[null,{"$f":"Calculate!B8","v":"Implement                    Rent"},{"$f":"Calculate!C8","v":"Width"},{"$f":"Calculate!D8","v":"Speed (mph)"},"Purchase Price/\nRental Rate",{"$f":"Calculate!F8","v":"Hours @\nPurchase"},null,"Fertilizer Spreader",null,1,null,null,{"$f":"+J8+IF(M12>0,1,0)","v":2},2.4,null,null,false,"<< Modified Fert trips",null,null,null,null,null,null,null,null,null,null,null,null,null,null,null,null,{"$f":"IF(J8=Calculate!J8,0,1)","v":0}]
[null,null,null,null,null,null,null,"Urea [46-0-0]","lb",65,0.15,null,{"$f":"J9*IF(OR(M15=0,M15=\"\"),1,(1-B32))","v":64.674999999999997},{"$f":"M9*K9","v":9.7012499999999999},null,null,null,null,null,null,null,null,null,null,null,null,null,null,null,null,null,null,null,null,{"$f":"IF(J9=Calculate!J9,0,1)","v":0},{"$f":"IF(K9=Calculate!K9,0,1)","v":0}]
[null,"Fertilizer Spreader Rental","40 ft",7,0,null,null,"Triple Superphosphate [0-45-0]","lb",0,0.22,null,{"$f":"J10*IF(OR(M15=0,M15=\"\"),1-IF(OR(M12=0,M12=\"\"),0,B35),1-B32-IF(OR(M12=0,M12=\"\"),0,B35))","v":0},{"$f":"M10*K10","v":0},null,null,null,null,null,null,null,null,null,null,null,null,null,{"$f":"IF(C10=Calculate!C10,0,1)","v":0},{"$f":"IF(D10=Calculate!D10,0,1)","v":0},{"$f":"IF(E10=Calculate!E10,0,1)","v":0},{"$f":"IF(F10=Calculate!F10,0,1)","v":0},null,null,null,{"$f":"IF(J10=Calculate!J10,0,1)","v":0},{"$f":"IF(K10=Calculate!K10,0,1)","v":0}]
{"$rows_left_out":30}
{"sheet":"SavedTemp","index":3,"n_rows":39,"n_cols":25,"rows_kept":39,"cut":false,"hidden":false,"merged":[]}
[]
[null,null,"Default Saved",null,null,"Sample",null,null,null,"Karen"]
[]
[]
[]
[]
[null,"2 WD 50",32200,0,600]
[null,null,null,null,null,null,null,null,null,1,null,null,{"$f":"+J8+IF(M12>0,1,0)","v":1},null,null,null,false]
[null,null,null,null,null,null,null,null,null,65,0.15,null,64.674999999999997,9.6999999999999993]
[null,"Fertilizer Spreader Rental","40 ft",7,0,null,null,null,null,0,0.22,null,0,0]
{"$rows_left_out":30}
{"sheet":"Compare","index":4,"n_rows":41,"n_cols":12,"rows_kept":41,"cut":false,"hidden":false,"merged":[[6,6,6,8],[2,0,2,8],[6,2,6,4],[40,1,46,7]]}
[]
[]
["Pasture Aeration and Fertilization Payoff Comparison"]
[]
[]
[]
[null,"Operation Parameters",{"$f":"Saved1!C2","v":"Default Saved"},null,null,null,{"$f":"Saved2!F2","v":"Sample"}]
[null,{"$f":"Saved1!B16","v":"Area affected"},{"$f":"Saved1!C16","v":300},{"$f":"Saved1!D16","v":"in acres"},null,null,{"$f":"Saved2!C16","v":300},{"$f":"Saved2!D16","v":"in acres"},null,null,null,"Yes"]
[null,{"$f":"Saved1!B17","v":"Exp. Hay Price"},{"$f":"Saved1!C17","v":35},{"$f":"Saved1!D17","v":"per 1,200 lb. bale"},null,null,{"$f":"Saved2!C17","v":30},{"$f":"Saved2!D17","v":"per 1,200 lb. bale"},null,null,null,"No"]
[null,{"$f":"Saved1!B18","v":"Exp. Hay Yields"},{"$f":"Saved1!C18","v":5},{"$f":"Saved1!D18","v":"bales/acre"},null,null,{"$f":"Saved2!C18","v":5},{"$f":"Saved2!D18","v":"bales/acre"}]
{"$rows_left_out":32}
{"sheet":"Defaults","index":5,"n_rows":43,"n_cols":17,"rows_kept":43,"cut":false,"hidden":false,"merged":[[12,10,13,10],[12,11,13,11],[2,5,3,5],[4,1,4,2],[2,1,3,2],[2,3,3,3],[2,4,3,4],[10,1,10,2],[11,1,11,2],[12,1,12,2],[5,1,5,2],[7,1,7,2],[8,1,8,2],[9,1,9,2],[6,1,6,2],[2,6,3,6]]}
[]
[null,null,null,null,null,null,null,null,null,null,null,"Labor Rates"]
[null,"Operation/\n   Operating Input",null,"Unit","# of trips/\nQuantity","Unit Cost","# of trips/\nQuantity",null,null,null,null,"Operator",13.14,"per hour"]
[null,null,null,null,null,null,null,null,null,null,null,"Hired Labor",9.06,"per hour"]
[null,"Fertilizer Spreader",null,null,1,{"$f":"\"\"","v":""},{"$f":"Calculate!J8+IF(Calculate!M12>0,1,0)","v":2},null,"Exp. Hay Price"]
[null,"Urea [46-0-0]",null,"lb",{"$f":"F16","v":200},0.15,null,null,35,"per bale",null,"Interest Rates"]
[null,"Triple Superphosphate [0-45-0]",null,"lb",{"$f":"F17","v":110},0.22,null,null,null,null,null,"Ammoritization",0.06]
[null,"Potash [0-0-60]",null,"lb",{"$f":"F18","v":100},0.15,null,null,"Exp. Hay Yields",null,null,"Operating",4.7500000000000001E-2]
[null,"Gypsum",null,"ton",1,{"$f":"31","v":31},null,null,5,"bales/acre"]
[null,"Manure Spreader",null,{"$f":"\"\"","v":""},1,{"$f":"\"\"","v":""},null,null,null,null,null,"Fuel Cost"]
{"$rows_left_out":34}
{"sheet":"Machinery","index":6,"n_rows":10,"n_cols":39,"rows_kept":10,"cut":false,"hidden":true,"merged":[]}
[]
[null,"Implement","Size/HP","Implement\nSuggested (list)\nPurchase Price","Implement\nHours at \nPurchase","Implement\nStandard\nEstimated \nUL Hours","Implement\nAcre-based Operating Years","Implement Expected\nSV","Implement\nRepair Factor\n(% of list price)","Implement\nField Efficiency\n(%)","Implement\nField Speed\n(mph)","Tractor \nRequirements","C1","C2","C3","Implement\nRV","Implement\nHours/Acre","Implement\nAcres/Hour","Implement\nAcre-based\nAnnual Use Hours","Implement\nCapital Recovery\n($/hr)","Implement\nR&M\n($/hr)","Selected\nTractor Size","Tractor\nPP","Tractor\nHrs at Purchase","Tractor\nHP","Tractor\nEst. UL Hours","Tractor\nEst. UL Years","Tractor\nRV","Tractor\nSV","Tractor\nAnnual\nUse Hrs","Tractor\nFuel Use\n(gal/hr)","Tractor\nCapital Recovery\n($/hr)","Tractor\nR&M\n($/hr)","Combined\nCapital Recovery\n($/hr)","Combined\nR&M\n($/hr)","Labor\n($/hr)","Fuel\n($/hr)","Cost/Unit\n($/acre)","Total Cost\n($/acre)"]
[{"$f":"LEFT($C$3,SEARCH(\" \",$C$3,1))","v":"40 "},{"$f":"Defaults!B32","v":"Fertilizer Spreader"},{"$f":"Calculate!$C$10","v":"40 ft"},{"$f":"IF(Calculate!Q14,0,Calculate!$E$10)","v":0},{"$f":"Calculate!$F$10","v":0},{"$f":"VLOOKUP(C3,Defaults!C32:E32,3,FALSE)","v":1200},{"$f":"IF((F3-E3)/S3>Defaults!$A$21,Defaults!$A$21,(F3-E3)/S3)","v":30},{"$f":"D3*P3","v":0},{"$f":"VLOOKUP($C$3,Defaults!$C$32:G32,5,FALSE)","v":0.8},{"$f":"VLOOKUP($C$3,Defaults!$C$32:H32,6,FALSE)","v":0.7},{"$f":"+Calculate!D10","v":7},{"$f":"VLOOKUP($C$3,Defaults!$C$32:J32,8,FALSE)","v":50},{"$f":"VLOOKUP($C$3,Defaults!$C$32:K32,9,FALSE)","v":0.94299999999999995},{"$f":"VLOOKUP($C$3,Defaults!$C$32:L32,10,FALSE)","v":0.111},{"$f":"VLOOKUP($C$3,Defaults!$C$32:M32,11,FALSE)","v":0},{"$f":"(M3-N3*G3^0.5-O3*S3^0.5)^2","v":0.11224373476523493},{"$f":"(1/((5280/43560)*A3*J3*K3))","v":4.2091836734693876E-2},{"$f":"1/Q3","v":23.757575757575758},{"$f":"Calculate!$J$8*Q3*Calculate!$C$16","v":12.627551020408163},{"$f":"IFERROR((((D3-H3)*(Calculate!$C$22/(1-((1+Calculate!$C$22)^(-G3))))+((H3*Calculate!$C$22)))/S3),0)","v":0},{"$f":"I3*D3/F3","v":0},{"$f":"Calculate!$B$7","v":"2 WD 50"},{"$f":"+Calculate!$C$7","v":32200},{"$f":"Calculate!$D$7","v":0},{"$f":"VLOOKUP(V3,Defaults!$B$22:$Q$29,4,FALSE)","v":50},{"$f":"VLOOKUP(V3,Defaults!$B$22:$Q$29,5,FALSE)","v":12000},{"$f":"IF((Z3-X3)/AD3>Defaults!$A$21,Defaults!$A$21,(Z3-X3)/AD3)","v":20},{"$f":"(VLOOKUP(V3,Defaults!$M$22:$P$29,2,FALSE)-VLOOKUP(V3,Defaults!$M$22:$P$29,3,FALSE)*AA3^0.5-VLOOKUP(V3,Defaults!$M$22:$P$29,4,FALSE)*AD3^0.5)^2","v":0.17894672507260678},{"$f":"W3*AB3","v":5762.0845473379386},{"$f":"Calculate!$E$7","v":600},{"$f":"0.044*Y3","v":2.1999999999999997},{"$f":"IFERROR((((W3-AC3)*(Calculate!$C$22/(1-((1+Calculate!$C$22)^(-AA3))))+((AC3*Calculate!$C$22)))/AD3),0)","v":4.4178383649534538},{"$f":"IFERROR(VLOOKUP(V3,Defaults!$B$22:$Q$29,16,FALSE)*W3/Z3,0)","v":2.6833333333333331},{"$f":"T3+AF3","v":4.4178383649534538},2.6833333333333331,{"$f":"Calculate!$C$20+Calculate!$C$21*(1.5-1)","v":17.670000000000002},{"$f":"AE3*Calculate!$C$19","v":3.8499999999999996},{"$f":"ROUND(1/R3*(1*Calculate!$C$20+(1.5-1)*Calculate!$C$21),2)+ROUND(AE3*Calculate!$C$19/R3,2)+ROUND(AI3/R3,2)+ROUND(AH3/R3,2)","v":1.2},{"$f":"AL3*Calculate!$J$8","v":1.2}]
[15,{"$f":"Defaults!B33","v":"Manure Spreader"},{"$f":"Calculate!$C$11","v":"Small"},{"$f":"IF(Calculate!Q15,0,Calculate!$E$11)","v":10266.299999999999},{"$f":"Calculate!$F$11","v":0},{"$f":"VLOOKUP(C4,Defaults!C33:E35,3,FALSE)","v":2000},{"$f":"IF((F4-E4)/S4>Defaults!$A$21,Defaults!$A$21,(F4-E4)/S4)","v":30},{"$f":"D4*P4","v":1152.3278542203313},{"$f":"VLOOKUP($C$4,Defaults!$C$33:G35,5,FALSE)","v":0.5},{"$f":"VLOOKUP($C$4,Defaults!$C$33:H35,6,FALSE)","v":0.65},{"$f":"+Calculate!D11","v":5},{"$f":"VLOOKUP($C$4,Defaults!$C$33:J35,8,FALSE)","v":50},{"$f":"VLOOKUP($C$4,Defaults!$C$33:K35,9,FALSE)","v":0.94299999999999995},{"$f":"VLOOKUP($C$4,Defaults!$C$33:L35,10,FALSE)","v":0.111},{"$f":"VLOOKUP($C$4,Defaults!$C$33:M35,11,FALSE)","v":0},{"$f":"(M4-N4*G4^0.5-O4*S4^0.5)^2","v":0.11224373476523493},{"$f":"(1/((5280/43560)*A4*J4*K4))","v":0.16923076923076924},{"$f":"1/Q4","v":5.9090909090909092},{"$f":"Calculate!$J$13*Q4*Calculate!$C$16","v":50.769230769230774},{"$f":"IFERROR((((D4-H4)*(Calculate!$C$22/(1-((1+Calculate!$C$22)^(-G4))))+((H4*Calculate!$C$22)))/S4),0)","v":14.403602652926351},{"$f":"I4*D4/F4","v":2.5665749999999998},{"$f":"Calculate!$B$7","v":"2 WD 50"},{"$f":"+Calculate!$C$7","v":32200},{"$f":"Calculate!$D$7","v":0},{"$f":"VLOOKUP(V4,Defaults!$B$22:$Q$29,4,FALSE)","v":50},{"$f":"VLOOKUP(V4,Defaults!$B$22:$Q$29,5,FALSE)","v":12000},{"$f":"IF((Z4-X4)/AD4>Defaults!$A$21,Defaults!$A$21,(Z4-X4)/AD4)","v":20},{"$f":"(VLOOKUP(V4,Defaults!$M$22:$P$29,2,FALSE)-VLOOKUP(V4,Defaults!$M$22:$P$29,3,FALSE)*AA4^0.5-VLOOKUP(V4,Defaults!$M$22:$P$29,4,FALSE)*AD4^0.5)^2","v":0.17894672507260678},{"$f":"W4*AB4","v":5762.0845473379386},{"$f":"Calculate!$E$7","v":600},{"$f":"0.044*Y4","v":2.1999999999999997},{"$f":"IFERROR((((W4-AC4)*(Calculate!$C$22/(1-((1+Calculate!$C$22)^(-AA4))))+((AC4*Calculate!$C$22)))/AD4),0)","v":4.4178383649534538},{"$f":"IFERROR(VLOOKUP(V4,Defaults!$B$22:$Q$29,16,FALSE)*W4/Z4,0)","v":2.6833333333333331},18.821441017879806,5.249908333333333,{"$f":"Calculate!$C$20","v":13.14},{"$f":"AE4*Calculate!$C$19","v":3.8499999999999996},{"$f":"ROUND(1/R4*(1*Calculate!$C$20+(1.5-1)*Calculate!$C$21),2)+ROUND(AE4*Calculate!$C$19/R4,2)+ROUND(AI4/R4,2)+ROUND(AH4/R4,2)","v":7.7200000000000006},{"$f":"AL4*Calculate!$J$13","v":7.7200000000000006}]
[{"$f":"LEFT($C$5,SEARCH(\" \",$C$5,1))","v":"10 "},{"$f":"Defaults!B36","v":"Aerator"},{"$f":"Calculate!$C$12","v":"10 ft"},{"$f":"IF(Calculate!Q13,0,Calculate!$E$12)","v":0},{"$f":"Calculate!$F$12","v":0},{"$f":"VLOOKUP(C5,Defaults!C36:E40,3,FALSE)","v":2000},{"$f":"IF((F5-E5)/S5>Defaults!$A$21,Defaults!$A$21,(F5-E5)/S5)","v":21.01010101010101},{"$f":"D5*P5","v":0},{"$f":"VLOOKUP($C$5,Defaults!$C$36:G40,5,FALSE)","v":0.5},{"$f":"VLOOKUP($C$5,Defaults!$C$36:H40,6,FALSE)","v":0.65},{"$f":"+Calculate!D12","v":4},{"$f":"VLOOKUP($C$5,Defaults!$C$36:J40,8,FALSE)","v":75},{"$f":"VLOOKUP($C$5,Defaults!$C$36:K40,9,FALSE)","v":0.94299999999999995},{"$f":"VLOOKUP($C$5,Defaults!$C$36:L40,10,FALSE)","v":0.111},{"$f":"VLOOKUP($C$5,Defaults!$C$36:M40,11,FALSE)","v":0},0.18853986841034662,{"$f":"(1/((5280/43560)*A5*J5*K5))","v":0.31730769230769229},{"$f":"1/Q5","v":3.1515151515151518},{"$f":"Calculate!$M$15*Q5*Calculate!$C$16","v":95.192307692307693},{"$f":"IFERROR((((D5-H5)*(Calculate!$C$22/(1-((1+Calculate!$C$22)^(-G5))))+((H5*Calculate!$C$22)))/S5),0)","v":0},{"$f":"I5*D5/F5","v":0},{"$f":"Calculate!$B$7","v":"2 WD 50"},{"$f":"+Calculate!$C$7","v":32200},{"$f":"Calculate!$D$7","v":0},{"$f":"VLOOKUP(V5,Defaults!$B$22:$Q$29,4,FALSE)","v":50},{"$f":"VLOOKUP(V5,Defaults!$B$22:$Q$29,5,FALSE)","v":12000},{"$f":"IF((Z5-X5)/AD5>Defaults!$A$21,Defaults!$A$21,(Z5-X5)/AD5)","v":20},{"$f":"(VLOOKUP(V5,Defaults!$M$22:$P$29,2,FALSE)-VLOOKUP(V5,Defaults!$M$22:$P$29,3,FALSE)*AA5^0.5-VLOOKUP(V5,Defaults!$M$22:$P$29,4,FALSE)*AD5^0.5)^2","v":0.17894672507260678},{"$f":"W5*AB5","v":5762.0845473379386},{"$f":"Calculate!$E$7","v":600},{"$f":"0.044*Y5","v":2.1999999999999997},{"$f":"IFERROR((((W5-AC5)*(Calculate!$C$22/(1-((1+Calculate!$C$22)^(-AA5))))+((AC5*Calculate!$C$22)))/AD5),0)","v":4.4178383649534538},{"$f":"IFERROR(VLOOKUP(V5,Defaults!$B$22:$Q$29,16,FALSE)*W5/Z5,0)","v":2.6833333333333331},4.4178383649534538,2.6833333333333331,{"$f":"Calculate!$C$20","v":13.14},{"$f":"AE5*Calculate!$C$19","v":3.8499999999999996},{"$f":"ROUND(1/R5*Calculate!$C$20,2)+ROUND(AE5*Calculate!$C$19/R5,2)+ROUND(AI5/R5,2)+ROUND(AH5/R5,2)","v":7.6399999999999988},{"$f":"AL5*Calculate!$M$15","v":7.6399999999999988}]
[{"$f":"LEFT($C$6,SEARCH(\" \",$C$6,1))","v":"40 "},{"$f":"Defaults!B32","v":"Fertilizer Spreader"},{"$f":"Calculate!$C$10","v":"40 ft"},{"$f":"IF(Calculate!Q14,0,Calculate!$E$10)","v":0},{"$f":"Calculate!$F$10","v":0},{"$f":"VLOOKUP(C3,Defaults!C32:E32,3,FALSE)","v":1200},{"$f":"IF((F6-E6)/S6>Defaults!$A$21,Defaults!$A$21,(F6-E6)/S6)","v":30},{"$f":"D6*P6","v":0},{"$f":"VLOOKUP($C$3,Defaults!$C$32:G32,5,FALSE)","v":0.8},{"$f":"VLOOKUP($C$3,Defaults!$C$32:H32,6,FALSE)","v":0.7},{"$f":"+Calculate!D10","v":7},{"$f":"VLOOKUP($C$3,Defaults!$C$32:J32,8,FALSE)","v":50},{"$f":"VLOOKUP($C$3,Defaults!$C$32:K32,9,FALSE)","v":0.94299999999999995},{"$f":"VLOOKUP($C$3,Defaults!$C$32:L32,10,FALSE)","v":0.111},{"$f":"VLOOKUP($C$3,Defaults!$C$32:M32,11,FALSE)","v":0},{"$f":"(M6-N6*G6^0.5-O6*S6^0.5)^2","v":0.11224373476523493},{"$f":"(1/((5280/43560)*A6*J6*K6))","v":4.2091836734693876E-2},{"$f":"1/Q6","v":23.757575757575758},{"$f":"Calculate!$M$8*Q6*Calculate!$C$16","v":25.255102040816325},{"$f":"IFERROR((((D6-H6)*(Calculate!$C$22/(1-((1+Calculate!$C$22)^(-G6))))+((H6*Calculate!$C$22)))/S6),0)","v":0},{"$f":"I6*D6/F6","v":0},{"$f":"Calculate!$B$7","v":"2 WD 50"},{"$f":"+Calculate!$C$7","v":32200},{"$f":"Calculate!$D$7","v":0},{"$f":"VLOOKUP(V6,Defaults!$B$22:$Q$29,4,FALSE)","v":50},{"$f":"VLOOKUP(V6,Defaults!$B$22:$Q$29,5,FALSE)","v":12000},{"$f":"IF((Z6-X6)/AD6>Defaults!$A$21,Defaults!$A$21,(Z6-X6)/AD6)","v":20},{"$f":"(VLOOKUP(V6,Defaults!$M$22:$P$29,2,FALSE)-VLOOKUP(V6,Defaults!$M$22:$P$29,3,FALSE)*AA6^0.5-VLOOKUP(V6,Defaults!$M$22:$P$29,4,FALSE)*AD6^0.5)^2","v":0.17894672507260678},{"$f":"W6*AB6","v":5762.0845473379386},{"$f":"Calculate!$E$7","v":600},{"$f":"0.044*Y6","v":2.1999999999999997},{"$f":"IFERROR((((W6-AC6)*(Calculate!$C$22/(1-((1+Calculate!$C$22)^(-AA6))))+((AC6*Calculate!$C$22)))/AD6),0)","v":4.4178383649534538},{"$f":"IFERROR(VLOOKUP(V6,Defaults!$B$22:$Q$29,16,FALSE)*W6/Z6,0)","v":2.6833333333333331},{"$f":"T6+AF6","v":4.4178383649534538},{"$f":"U6+AG6","v":2.6833333333333331},{"$f":"Calculate!$C$20+Calculate!$C$21*(1.5-1)","v":17.670000000000002},{"$f":"AE6*Calculate!$C$19","v":3.8499999999999996},{"$f":"ROUND(1/R6*(1*Calculate!$C$20+(1.5-1)*Calculate!$C$21),2)+ROUND(AE6*Calculate!$C$19/R6,2)+ROUND(AI6/R6,2)+ROUND(AH6/R6,2)","v":1.2},{"$f":"AL6*Calculate!$J$8","v":1.2}]
[]
[null,"Bottom row is for added use of fertilizer spreader if gypsum is applied"]
[]
[null,null,null,null,null,null,null,null,null,null,null,null,null,null,null,null,null,null,null,null,null,null,null,null,null,null,null,null,null,null,null,null,null,{"$f":"SUM(AF5,AG5,AJ5,AK5)","v":24.091171698286786}]