{"text_format":"1","workbook":"xlsx","n_sheets":7,"sheets":["Sheet1","Title","User Page","Equipment","Litter","Fertilizer","Comparison"],"not_rendered":{"charts":0,"images":14,"macros":1,"external_links":0,"defined_names":27,"comments":6,"pivot_tables":0},"unopened":[],"bounds":{"document_bytes":16777216,"sheet_cells":100000,"rows_first":2000,"rows_last":500,"rows_between":2000,"halvings":0,"cell_chars":16384,"cell_head_chars":4096},"cells_cut":0,"cells_raw":0,"read":"whole","date_system":"1900"}

{"sheet":"Sheet1","index":0,"n_rows":18,"n_cols":2,"rows_kept":18,"cut":false,"hidden":true,"merged":[[1,1,1,2]]}
[]
[null,"To Do List 8.20.20"]
[]
[]
[null,"Comparison page chart? Visual?"]
[null,"Save Macro"]
[null,"comments"]
[null,"To  reset whole sheet, need to go to each sheet and reset to default each using the back button"]
{"$rows_left_out":11}
{"sheet":"Title","index":1,"n_rows":29,"n_cols":9,"rows_kept":29,"cut":false,"hidden":false,"merged":[[18,3,18,14],[28,1,37,16]]}
[]
[]
[]
[]
[]
[]
[]
[]
{"$rows_left_out":22}
{"sheet":"User Page","index":2,"n_rows":39,"n_cols":8,"rows_kept":39,"cut":false,"hidden":false,"merged":[[23,1,23,5],[9,4,10,4],[9,5,10,5],[29,4,30,4],[29,5,30,5]]}
[]
[]
[]
[]
[null,"Acres Fertilized",300,null,"Fertilizer Cost","$/ton"]
[null,null,"$/ton",null,"Price of Urea (46 - 0 - 0)",400.63636363636357]
[null,"Cost of Litter",45,null,"Price of Triple Super Phosphate (0 - 46 - 0)",456.94545454545454]
[null,"Litter Nutrient Analysis","in %",null,"Price of Muriate of Potash (0 - 0 - 60)",473.0181818181818]
{"$rows_left_out":32}
{"sheet":"Equipment","index":3,"n_rows":108,"n_cols":60,"rows_kept":108,"cut":false,"hidden":false,"merged":[[49,34,49,35],[5,4,6,4],[1,2,1,27],[144,34,144,35]]}
[]
[null,null,"Specification of Equipment Choices",null,null,null,null,null,null,null,null,null,null,null,null,null,null,null,null,null,null,null,null,null,null,null,null,null,null,null,null,null,null,null,null,null,null,true,"Temporary flag to turn off autoupdate",null,null,null,null,null,"Insurance (% of avg. value)","Property Taxes (% of avg. value)"]
[null,null,null,null,null,null,null,null,null,null,null,null,null,null,null,null,null,null,null,null,null,null,null,null,null,null,null,null,null,null,null,null,null,null,null,null,null,null,null,null,null,null,null,null,5.4999999999999997E-3,7.4999999999999997E-3]
[null,null,null,null,null,null,null,null,null,null,null,null,null,null,null,null,null,null,null,null,null,null,null,null,null,null,null,null,null,null,null,null,null,null,null,null,{"$f":"OR(AK6,AK7,AK8,AK9,AK11,AK12)","v":false}]
[null,null,null,null,null,"Equipment Type (Changes load defaults)","Name","Rent/Lease, Custom activity, or Owned?","Rental/Lease Fee in $/hr or Custom Rate in $/acre","Age of Equipment at time of purchase (years)","Existing hours on equipment (at time of purchase)","Annual hours of usage","Default List Price (New)","Est. Purchase Price","Remaining Useful Life (Years)","Expected Salvage Value (w/o inflation)","Capital Recovery Factor","Annual Capital Recovery","Repair Factor (% of list price over useful life)","Annual Repair & Maintenance",{"$f":"CONCATENATE(\"Yearly Insurance (\",ROUND($AS$3*100,2),\" % of avg. value)\")","v":"Yearly Insurance (0.55 % of avg. value)"},{"$f":"CONCATENATE(\"Yearly Property Tax (\",ROUND($AT$3*100,2),\" % of avg. value)\")","v":"Yearly Property Tax (0.75 % of avg. value)"},"Ownership Cost per hour","C1","C2","C3","Min HP","Useful Life in hours",null,null,null,null,null,null,null,null,"Not Saved?","Equipment Type","Name","Rent/Lease, Custom activity, or Owned?","Rental/Lease Fee per hour","Age of Equipment at time of purchase (years)","Existing hours on equipment (at time of purchase)","Annual hours of usage","Default List Price (New)","Est. Purchase Price","Remaining Useful Life (Years)","Expected Salvage Value (w/o inflation)","Capital Recovery Factor","Capital Recovery","Repair Factor (% of list price over useful life)","Annual Repair & Maintenance",{"$f":"CONCATENATE(\"Insurance (\",ROUND($AS$3*100,2),\" % of avg. value)\")","v":"Insurance (0.55 % of avg. value)"},{"$f":"CONCATENATE(\"Property Tax (\",ROUND($AT$3*100,2),\" % of avg. value)\")","v":"Property Tax (0.75 % of avg. value)"},"Ownership Cost per hour","C1","C2","C3","Min HP","Useful Life in hours"]
[null,null,null,null,"Tractors","MFWD55",{"$f":"VLOOKUP($F6,$F$48:$V$66,2,FALSE)","v":"John Deere 5055e 4wd"},"Owned",{"$f":"IF(H6=\"Owned\",\"N/A\",IF(H6=\"Custom\",VLOOKUP(F6,$F$48:$I$66,4,FALSE),\"Enter Fee\"))","v":"N/A"},{"$f":"IF(H6=\"Owned\",VLOOKUP($F6,$F$48:$V$66,5,FALSE),\"N/A\")","v":0},{"$f":"IF(H6=\"Owned\",VLOOKUP($F6,$F$48:$V$66,6,FALSE),\"N/A\")","v":0},{"$f":"IF(H6=\"Owned\",VLOOKUP($F6,$F$48:$V$66,7,FALSE),\"N/A\")","v":600},{"$f":"IF(H6=\"Owned\",VLOOKUP($F6,$F$48:$V$66,8,FALSE),\"N/A\")","v":33000},{"$f":"IF(H6=\"Owned\",IF(J6>0,M6*(X6-Y6*J6^0.5-Z6*(K6/J6)^0.5)^2,M6),\"N/A\")","v":33000},{"$f":"IF(H6=\"Owned\",IF((IF(((AB6-K6)/L6)>20,20,((AB6-K6)/L6))-J6)<0,0,(IF(((AB6-K6)/L6)>20,20,((AB6-K6)/L6))-J6)),\"N/A\")","v":20},{"$f":"IF(H6=\"Owned\",N6*((X6-Y6*(O6^0.5)-Z6*(L6^0.5)))^2,\"N/A\")","v":5905.241927396024},{"$f":"IF(H6=\"Owned\",('User Page'!$C$19*(1+'User Page'!$C$19)^O6)/(((1+'User Page'!$C$19)^O6)-1),\"N/A\")","v":8.7184556976851402E-2},{"$f":"IF(H6=\"Owned\",((N6-P6)*Q6)+(P6*'User Page'!$C$19),\"N/A\")","v":2716.5589945987072},{"$f":"VLOOKUP($F6,$F$48:$V$66,12,FALSE)","v":0.8},{"$f":"IF(H6=\"Owned\",S6*M6/IF(((AB6-K6)/L6)>20,20,((AB6-K6)/L6)),0)","v":1320},{"$f":"IF(H6=\"Owned\",$AS$3*AVERAGE(N6,P6),0)","v":106.98941530033906},{"$f":"IF(H6=\"Owned\",$AT$3*AVERAGE(N6,P6),0)","v":145.89465722773508},{"$f":"IF(H6=\"Owned\",(R6+T6+U6+V6)/L6,\"N/A\")","v":7.1490717785446369},{"$f":"IF(H6=\"Owned\",VLOOKUP($F6,$F$48:$V$66,13,FALSE),\"N/A\")","v":0.98099999999999998},{"$f":"IF(H6=\"Owned\",VLOOKUP($F6,$F$48:$V$66,14,FALSE),\"N/A\")","v":9.2999999999999999E-2},{"$f":"IF(H6=\"Owned\",VLOOKUP($F6,$F$48:$V$66,15,FALSE),\"N/A\")","v":5.7999999999999996E-3},{"$f":"VLOOKUP($F6,$F$48:$V$66,16,FALSE)","v":"-"},{"$f":"VLOOKUP($F6,$F$48:$V$66,17,FALSE)","v":16000},null,null,null,null,null,null,null,null,{"$f":"IF(AND(F6=AL6,G6=AM6,H6=AN6,I6=AO6,J6=AP6,K6=AQ6,L6=AR6,M6=AS6,N6=AT6,O6=AU6,P6=AV6,Q6=AW6,R6=AX6,S6=AY6,T6=AZ6,U6=BA6,V6=BB6,W6=BC6,X6=BD6,Y6=BE6,Z6=BF6,AA6=BG6,AB6=BH6),FALSE,TRUE)","v":false},"MFWD55",{"$f":"VLOOKUP($F6,$F$48:$V$66,2,FALSE)","v":"John Deere 5055e 4wd"},"Owned",{"$f":"IF(H6=\"Owned\",\"N/A\",IF(H6=\"Custom\",VLOOKUP(F6,$F$48:$I$66,4,FALSE),\"Enter Fee\"))","v":"N/A"},{"$f":"IF(H6=\"Owned\",VLOOKUP($F6,$F$48:$V$66,5,FALSE),\"N/A\")","v":0},{"$f":"IF(H6=\"Owned\",VLOOKUP($F6,$F$48:$V$66,6,FALSE),\"N/A\")","v":0},{"$f":"IF(H6=\"Owned\",VLOOKUP($F6,$F$48:$V$66,7,FALSE),\"N/A\")","v":600},{"$f":"IF(H6=\"Owned\",VLOOKUP($F6,$F$48:$V$66,8,FALSE),\"N/A\")","v":33000},{"$f":"IF(H6=\"Owned\",IF(J6>0,M6*(X6-Y6*J6^0.5-Z6*(K6/J6)^0.5)^2,M6),\"N/A\")","v":33000},{"$f":"IF(H6=\"Owned\",IF((IF(((AB6-K6)/L6)>20,20,((AB6-K6)/L6))-J6)<0,0,(IF(((AB6-K6)/L6)>20,20,((AB6-K6)/L6))-J6)),\"N/A\")","v":20},{"$f":"IF(H6=\"Owned\",N6*((X6-Y6*(O6^0.5)-Z6*(L6^0.5)))^2,\"N/A\")","v":5905.241927396024},{"$f":"IF(H6=\"Owned\",('User Page'!$C$19*(1+'User Page'!$C$19)^O6)/(((1+'User Page'!$C$19)^O6)-1),\"N/A\")","v":8.7184556976851402E-2},{"$f":"IF(H6=\"Owned\",((N6-P6)*Q6)+(P6*'User Page'!$C$19),\"N/A\")","v":2716.5589945987072},{"$f":"VLOOKUP($F6,$F$48:$V$66,12,FALSE)","v":0.8},{"$f":"IF(H6=\"Owned\",S6*M6/IF(((AB6-K6)/L6)>20,20,((AB6-K6)/L6)),0)","v":1320},{"$f":"IF(H6=\"Owned\",$AS$3*AVERAGE(N6,P6),0)","v":106.98941530033906},{"$f":"IF(H6=\"Owned\",$AT$3*AVERAGE(N6,P6),0)","v":145.89465722773508},{"$f":"IF(H6=\"Owned\",(R6+T6+U6+V6)/L6,\"N/A\")","v":7.1490717785446369},{"$f":"IF(H6=\"Owned\",VLOOKUP($F6,$F$48:$V$66,13,FALSE),\"N/A\")","v":0.98099999999999998},{"$f":"IF(H6=\"Owned\",VLOOKUP($F6,$F$48:$V$66,14,FALSE),\"N/A\")","v":9.2999999999999999E-2},{"$f":"IF(H6=\"Owned\",VLOOKUP($F6,$F$48:$V$66,15,FALSE),\"N/A\")","v":5.7999999999999996E-3},{"$f":"VLOOKUP($F6,$F$48:$V$66,16,FALSE)","v":"-"},{"$f":"VLOOKUP($F6,$F$48:$V$66,17,FALSE)","v":16000}]
[null,null,null,null,null,"MFWD110",{"$f":"VLOOKUP($F7,$F$48:$V$66,2,FALSE)","v":"John Deere 6110M 4wd"},"Owned",{"$f":"IF(H7=\"Owned\",\"N/A\",IF(H7=\"Custom\",VLOOKUP(F7,$F$48:$I$66,4,FALSE),\"Enter Fee\"))","v":"N/A"},{"$f":"IF(H7=\"Owned\",VLOOKUP($F7,$F$48:$V$66,5,FALSE),\"N/A\")","v":0},{"$f":"IF(H7=\"Owned\",VLOOKUP($F7,$F$48:$V$66,6,FALSE),\"N/A\")","v":0},{"$f":"IF(H7=\"Owned\",VLOOKUP($F7,$F$48:$V$66,7,FALSE),\"N/A\")","v":850},{"$f":"IF(H7=\"Owned\",VLOOKUP($F7,$F$48:$V$66,8,FALSE),\"N/A\")","v":110000},{"$f":"IF(H7=\"Owned\",IF(J7>0,M7*(X7-Y7*J7^0.5-Z7*(K7/J7)^0.5)^2,M7),\"N/A\")","v":110000},{"$f":"IF(H7=\"Owned\",IF((IF(((AB7-K7)/L7)>20,20,((AB7-K7)/L7))-J7)<0,0,(IF(((AB7-K7)/L7)>20,20,((AB7-K7)/L7))-J7)),\"N/A\")","v":18.823529411764707},{"$f":"IF(H7=\"Owned\",N7*((X7-Y7*(O7^0.5)-Z7*(L7^0.5)))^2,\"N/A\")","v":25855.043786272145},{"$f":"IF(H7=\"Owned\",('User Page'!$C$19*(1+'User Page'!$C$19)^O7)/(((1+'User Page'!$C$19)^O7)-1),\"N/A\")","v":9.0080503967433306E-2},{"$f":"IF(H7=\"Owned\",((N7-P7)*Q7)+(P7*'User Page'!$C$19),\"N/A\")","v":9131.1226892265422},{"$f":"VLOOKUP($F7,$F$48:$V$66,12,FALSE)","v":0.8},{"$f":"IF(H7=\"Owned\",S7*M7/IF(((AB7-K7)/L7)>20,20,((AB7-K7)/L7)),0)","v":4675},{"$f":"IF(H7=\"Owned\",$AS$3*AVERAGE(N7,P7),0)","v":373.6013704122484},{"$f":"IF(H7=\"Owned\",$AT$3*AVERAGE(N7,P7),0)","v":509.45641419852052},{"$f":"IF(H7=\"Owned\",(R7+T7+U7+V7)/L7,\"N/A\")","v":17.28138879274978},{"$f":"IF(H7=\"Owned\",VLOOKUP($F7,$F$48:$V$66,13,FALSE),\"N/A\")","v":0.94199999999999995},{"$f":"IF(H7=\"Owned\",VLOOKUP($F7,$F$48:$V$66,14,FALSE),\"N/A\")","v":0.1},{"$f":"IF(H7=\"Owned\",VLOOKUP($F7,$F$48:$V$66,15,FALSE),\"N/A\")","v":8.0000000000000004E-4},{"$f":"VLOOKUP($F7,$F$48:$V$66,16,FALSE)","v":"-"},{"$f":"VLOOKUP($F7,$F$48:$V$66,17,FALSE)","v":16000},null,null,null,null,null,null,null,null,{"$f":"IF(AND(F7=AL7,G7=AM7,H7=AN7,I7=AO7,J7=AP7,K7=AQ7,L7=AR7,M7=AS7,N7=AT7,O7=AU7,P7=AV7,Q7=AW7,R7=AX7,S7=AY7,T7=AZ7,U7=BA7,V7=BB7,W7=BC7,X7=BD7,Y7=BE7,Z7=BF7,AA7=BG7,AB7=BH7),FALSE,TRUE)","v":false},"MFWD110",{"$f":"VLOOKUP($F7,$F$48:$V$66,2,FALSE)","v":"John Deere 6110M 4wd"},"Owned",{"$f":"IF(H7=\"Owned\",\"N/A\",IF(H7=\"Custom\",VLOOKUP(F7,$F$48:$I$66,4,FALSE),\"Enter Fee\"))","v":"N/A"},{"$f":"IF(H7=\"Owned\",VLOOKUP($F7,$F$48:$V$66,5,FALSE),\"N/A\")","v":0},{"$f":"IF(H7=\"Owned\",VLOOKUP($F7,$F$48:$V$66,6,FALSE),\"N/A\")","v":0},{"$f":"IF(H7=\"Owned\",VLOOKUP($F7,$F$48:$V$66,7,FALSE),\"N/A\")","v":850},{"$f":"IF(H7=\"Owned\",VLOOKUP($F7,$F$48:$V$66,8,FALSE),\"N/A\")","v":110000},{"$f":"IF(H7=\"Owned\",IF(J7>0,M7*(X7-Y7*J7^0.5-Z7*(K7/J7)^0.5)^2,M7),\"N/A\")","v":110000},{"$f":"IF(H7=\"Owned\",IF((IF(((AB7-K7)/L7)>20,20,((AB7-K7)/L7))-J7)<0,0,(IF(((AB7-K7)/L7)>20,20,((AB7-K7)/L7))-J7)),\"N/A\")","v":18.823529411764707},{"$f":"IF(H7=\"Owned\",N7*((X7-Y7*(O7^0.5)-Z7*(L7^0.5)))^2,\"N/A\")","v":25855.043786272145},{"$f":"IF(H7=\"Owned\",('User Page'!$C$19*(1+'User Page'!$C$19)^O7)/(((1+'User Page'!$C$19)^O7)-1),\"N/A\")","v":9.0080503967433306E-2},{"$f":"IF(H7=\"Owned\",((N7-P7)*Q7)+(P7*'User Page'!$C$19),\"N/A\")","v":9131.1226892265422},{"$f":"VLOOKUP($F7,$F$48:$V$66,12,FALSE)","v":0.8},{"$f":"IF(H7=\"Owned\",S7*M7/IF(((AB7-K7)/L7)>20,20,((AB7-K7)/L7)),0)","v":4675},{"$f":"IF(H7=\"Owned\",$AS$3*AVERAGE(N7,P7),0)","v":373.6013704122484},{"$f":"IF(H7=\"Owned\",$AT$3*AVERAGE(N7,P7),0)","v":509.45641419852052},{"$f":"IF(H7=\"Owned\",(R7+T7+U7+V7)/L7,\"N/A\")","v":17.28138879274978},{"$f":"IF(H7=\"Owned\",VLOOKUP($F7,$F$48:$V$66,13,FALSE),\"N/A\")","v":0.94199999999999995},{"$f":"IF(H7=\"Owned\",VLOOKUP($F7,$F$48:$V$66,14,FALSE),\"N/A\")","v":0.1},{"$f":"IF(H7=\"Owned\",VLOOKUP($F7,$F$48:$V$66,15,FALSE),\"N/A\")","v":8.0000000000000004E-4},{"$f":"VLOOKUP($F7,$F$48:$V$66,16,FALSE)","v":"-"},{"$f":"VLOOKUP($F7,$F$48:$V$66,17,FALSE)","v":16000}]
[null,null,null,null,"Manure","Litter Drill (5 ton)",{"$f":"VLOOKUP($F8,$F$48:$V$66,2,FALSE)","v":"Litter Drill"},"Owned",{"$f":"IF(H8=\"Owned\",\"N/A\",IF(H8=\"Custom\",VLOOKUP(F8,$F$48:$I$66,4,FALSE),\"Enter Fee\"))","v":"N/A"},{"$f":"IF(H8=\"Owned\",VLOOKUP($F8,$F$48:$V$66,5,FALSE),\"N/A\")","v":0},{"$f":"IF(H8=\"Owned\",VLOOKUP($F8,$F$48:$V$66,6,FALSE),\"N/A\")","v":0},{"$f":"IF(Litter!H54/Litter!B14=0,50,Litter!H54/Litter!B14)","v":50},{"$f":"IF(H8=\"Owned\",VLOOKUP($F8,$F$48:$V$66,8,FALSE),\"N/A\")","v":65000},{"$f":"IF(H8=\"Owned\",IF(J8>0,M8*(X8-Y8*J8^0.5-Z8*(K8/J8)^0.5)^2,M8),\"N/A\")","v":65000},{"$f":"IF(H8=\"Owned\",IF((IF(((AB8-K8)/L8)>20,20,((AB8-K8)/L8))-J8)<0,0,(IF(((AB8-K8)/L8)>20,20,((AB8-K8)/L8))-J8)),\"N/A\")","v":20},{"$f":"IF(H8=\"Owned\",N8*((X8-Y8*(O8^0.5)-Z8*(L8^0.5)))^2,\"N/A\")","v":18547.17907059666},{"$f":"IF(H8=\"Owned\",('User Page'!$C$19*(1+'User Page'!$C$19)^O8)/(((1+'User Page'!$C$19)^O8)-1),\"N/A\")","v":8.7184556976851402E-2},{"$f":"IF(H8=\"Owned\",((N8-P8)*Q8)+(P8*'User Page'!$C$19),\"N/A\")","v":5162.7993572908408},{"$f":"VLOOKUP($F8,$F$48:$V$66,12,FALSE)","v":0.5},{"$f":"IF(H8=\"Owned\",S8*M8/IF(((AB8-K8)/L8)>20,20,((AB8-K8)/L8)),0)","v":1625},{"$f":"IF(H8=\"Owned\",$AS$3*AVERAGE(N8,P8),0)","v":229.75474244414079},{"$f":"IF(H8=\"Owned\",$AT$3*AVERAGE(N8,P8),0)","v":313.30192151473744},{"$f":"IF(H8=\"Owned\",(R8+T8+U8+V8)/L8,\"N/A\")","v":146.6171204249944},{"$f":"IF(H8=\"Owned\",VLOOKUP($F8,$F$48:$V$66,13,FALSE),\"N/A\")","v":0.88300000000000001},{"$f":"IF(H8=\"Owned\",VLOOKUP($F8,$F$48:$V$66,14,FALSE),\"N/A\")","v":7.8E-2},{"$f":"IF(H8=\"Owned\",VLOOKUP($F8,$F$48:$V$66,15,FALSE),\"N/A\")","v":0},{"$f":"VLOOKUP($F8,$F$48:$V$66,16,FALSE)","v":100},{"$f":"VLOOKUP($F8,$F$48:$V$66,17,FALSE)","v":2500},null,null,null,null,null,null,null,null,false,"Litter Drill (5 ton)",{"$f":"VLOOKUP($F8,$F$48:$V$66,2,FALSE)","v":"Litter Drill"},"Owned",{"$f":"IF(H8=\"Owned\",\"N/A\",IF(H8=\"Custom\",VLOOKUP(F8,$F$48:$I$66,4,FALSE),\"Enter Fee\"))","v":"N/A"},{"$f":"IF(H8=\"Owned\",VLOOKUP($F8,$F$48:$V$66,5,FALSE),\"N/A\")","v":0},{"$f":"IF(H8=\"Owned\",VLOOKUP($F8,$F$48:$V$66,6,FALSE),\"N/A\")","v":0},{"$f":"IF(Litter!H54/Litter!B14=0,50,Litter!H54/Litter!B14)","v":50},{"$f":"IF(H8=\"Owned\",VLOOKUP($F8,$F$48:$V$66,8,FALSE),\"N/A\")","v":65000},{"$f":"IF(H8=\"Owned\",IF(J8>0,M8*(X8-Y8*J8^0.5-Z8*(K8/J8)^0.5)^2,M8),\"N/A\")","v":65000},{"$f":"IF(H8=\"Owned\",IF((IF(((AB8-K8)/L8)>20,20,((AB8-K8)/L8))-J8)<0,0,(IF(((AB8-K8)/L8)>20,20,((AB8-K8)/L8))-J8)),\"N/A\")","v":20},{"$f":"IF(H8=\"Owned\",N8*((X8-Y8*(O8^0.5)-Z8*(L8^0.5)))^2,\"N/A\")","v":18547.17907059666},{"$f":"IF(H8=\"Owned\",('User Page'!$C$19*(1+'User Page'!$C$19)^O8)/(((1+'User Page'!$C$19)^O8)-1),\"N/A\")","v":8.7184556976851402E-2},{"$f":"IF(H8=\"Owned\",((N8-P8)*Q8)+(P8*'User Page'!$C$19),\"N/A\")","v":5162.7993572908408},{"$f":"VLOOKUP($F8,$F$48:$V$66,12,FALSE)","v":0.5},{"$f":"IF(H8=\"Owned\",S8*M8/IF(((AB8-K8)/L8)>20,20,((AB8-K8)/L8)),0)","v":1625},{"$f":"IF(H8=\"Owned\",$AS$3*AVERAGE(N8,P8),0)","v":229.75474244414079},{"$f":"IF(H8=\"Owned\",$AT$3*AVERAGE(N8,P8),0)","v":313.30192151473744},{"$f":"IF(H8=\"Owned\",(R8+T8+U8+V8)/L8,\"N/A\")","v":146.6171204249944},{"$f":"IF(H8=\"Owned\",VLOOKUP($F8,$F$48:$V$66,13,FALSE),\"N/A\")","v":0.88300000000000001},{"$f":"IF(H8=\"Owned\",VLOOKUP($F8,$F$48:$V$66,14,FALSE),\"N/A\")","v":7.8E-2},{"$f":"IF(H8=\"Owned\",VLOOKUP($F8,$F$48:$V$66,15,FALSE),\"N/A\")","v":0},{"$f":"VLOOKUP($F8,$F$48:$V$66,16,FALSE)","v":100},{"$f":"VLOOKUP($F8,$F$48:$V$66,17,FALSE)","v":2500}]
{"$rows_left_out":101}
{"sheet":"Litter","index":4,"n_rows":192,"n_cols":56,"rows_kept":192,"cut":false,"hidden":false,"merged":[[5,9,5,11],[28,10,28,12],[16,4,16,5],[33,8,34,8],[35,8,36,8],[8,6,8,7],[9,6,9,7],[14,10,14,11],[184,1,187,1],[127,6,127,7],[157,5,157,7],[172,1,174,1],[177,1,180,1],[3,1,3,12],[152,8,153,8],[154,8,155,8],[66,1,69,1],[53,1,55,1],[17,6,17,7],[18,6,18,7],[41,5,41,7],[19,6,19,7],[128,6,128,7],[136,6,136,7],[137,6,137,7],[37,8,38,8],[13,10,13,11],[85,8,86,8],[87,5,87,7],[12,13,13,13],[50,14,54,14],[56,14,57,14],[122,1,122,5],[101,1,104,1],[15,13,16,13],[26,13,28,13],[36,13,37,13],[12,14,13,14],[20,13,25,13]]}
[null,null,null,null,null,null,null,null,null,null,null,null,null,null,null,"Tractor List","hp","Implement List","hp",null,"Tractor list filtered",null,null,null,"Implement",null,null,null,null,"Tractor Asset costs",null,"implement asset costs"]
[null,null,null,null,null,null,null,null,null,null,null,null,null,null,null,{"$f":"D54","v":"John Deere 6110M 4wd"},{"$f":"IFERROR(VLOOKUP(P2,Equipment!$H$102:$I$108,2,FALSE),0)","v":110},{"$f":"E54","v":"Litter Drill"},{"$f":"IFERROR(VLOOKUP(R2,Equipment!$H$102:$I$108,2,FALSE),0)","v":100},null,{"$f":"P2","v":"John Deere 6110M 4wd"},{"$f":"IFERROR(VLOOKUP(U2,Equipment!$G$6:$N$12,7,FALSE),0)","v":110000},null,null,{"$f":"R2","v":"Litter Drill"},{"$f":"IFERROR(VLOOKUP(Y2,Equipment!$G$6:$N$12,7,FALSE),0)","v":65000},null,null,null,{"$f":"SUM(V2:V8)","v":143000},null,{"$f":"SUM(Z2:Z8)","v":70000}]
[null,null,null,null,null,null,null,null,null,null,null,null,null,null,null,{"$f":"D55","v":"John Deere 5055e 4wd"},{"$f":"IFERROR(VLOOKUP(P3,Equipment!$H$102:$I$108,2,FALSE),0)","v":55},{"$f":"E55","v":"Loader"},{"$f":"IFERROR(VLOOKUP(R3,Equipment!$H$102:$I$108,2,FALSE),0)","v":0},null,{"$f":"P3","v":"John Deere 5055e 4wd"},{"$f":"IFERROR(VLOOKUP(U3,Equipment!$G$6:$N$12,7,FALSE),0)","v":33000},null,null,{"$f":"R3","v":"Loader"},{"$f":"IFERROR(VLOOKUP(Y3,Equipment!$G$6:$N$12,7,FALSE),0)","v":5000}]
[null,"Litter & Fertilizer Application Details",null,null,null,null,null,null,null,null,null,null,null,null,null,{"$f":"D59","v":"John Deere 5055e 4wd"},{"$f":"IFERROR(VLOOKUP(P4,Equipment!$H$102:$I$108,2,FALSE),0)","v":55},{"$f":"E59","v":"BBI Spreader"},{"$f":"IFERROR(VLOOKUP(R4,Equipment!$H$102:$I$108,2,FALSE),0)","v":45},null,null,null,null,null,{"$f":"R4","v":"BBI Spreader"},{"$f":"IFERROR(VLOOKUP(Y4,Equipment!$G$6:$N$12,7,FALSE),0)","v":"N/A"},null,null,null,null,null,null,null,null,null,null,null,null,null,null,null,null,null,null,null,null,null,null,null,null,"Percent Probabilty of suitable days"]
[null,null,null,null,null,null,null,null,null,null,null,null,null,null,null,{"$f":"D67","v":"None"},{"$f":"IFERROR(VLOOKUP(P5,Equipment!$H$102:$I$108,2,FALSE),0)","v":0},{"$f":"E67","v":"None"},{"$f":"IFERROR(VLOOKUP(R5,Equipment!$H$102:$I$108,2,FALSE),0)","v":0},null,null,null,null,null,null,null,null,null,null,null,null,null,null,null,null,null,null,null,null,null,null,null,null,null,null,null,null,null,null,"Month",0.15,0.35,0.5,0.65,0.85]
[null,"Acres fertilized","Cost of Litter / Ton","Tons of litter needed","Truckloads",null,"Refill time (minutes) (1)","Refills needed",null,"Litter",null,null,null,"Broadcast Litter Applied in Tons",null,{"$f":"D68","v":"None"},{"$f":"IFERROR(VLOOKUP(P6,Equipment!$H$102:$I$108,2,FALSE),0)","v":0},{"$f":"E68","v":"None"},{"$f":"IFERROR(VLOOKUP(R6,Equipment!$H$102:$I$108,2,FALSE),0)","v":0},null,null,null,null,null,null,null,null,null,null,null,null,null,null,null,null,null,null,null,null,null,null,null,null,null,null,null,null,null,null,"April",{"$f":"(AVERAGE(AZ17:AZ19)+AVERAGE(AZ48:AZ50))/2","v":3.1666666666666665},{"$f":"(AVERAGE(BA17:BA19)+AVERAGE(BA48:BA50))/2","v":4.0333333333333332},{"$f":"(AVERAGE(BB17:BB19)+AVERAGE(BB48:BB50))/2","v":4.6333333333333329},{"$f":"(AVERAGE(BC17:BC19)+AVERAGE(BC48:BC50))/2","v":5.2},{"$f":"(AVERAGE(BD17:BD19)+AVERAGE(BD48:BD50))/2","v":6}]
[null,{"$f":"+'User Page'!C5","v":300},{"$f":"'User Page'!C7","v":45},{"$f":"B16*B7","v":400},{"$f":"ROUNDUP(D7/25,0)","v":16},null,15,{"$f":"ROUNDUP(B7*B16/B18,0)","v":80},null,null,null,null,null,{"$f":"+B7*N15","v":400},null,{"$f":"D69","v":"None"},{"$f":"IFERROR(VLOOKUP(P7,Equipment!$H$102:$I$108,2,FALSE),0)","v":0},{"$f":"E69","v":"None"},{"$f":"IFERROR(VLOOKUP(R7,Equipment!$H$102:$I$108,2,FALSE),0)","v":0},null,null,null,null,null,null,null,null,null,null,"Annualized Equipment Cost (Dep., Opp. Cost, Ins., Taxes)","Repair & Maintenance",null,null,null,null,null,null,null,null,null,null,null,null,null,null,null,null,null,null,"May",{"$f":"SUM(AZ20:AZ24)","v":15.7},{"$f":"SUM(BA20:BA24)","v":20.300000000000004},{"$f":"SUM(BB20:BB24)","v":23.2},{"$f":"SUM(BC20:BC24)","v":26.2},{"$f":"SUM(BD20:BD24)","v":30.9}]
[null,null,null,null,null,null,null,null,null,null,null,null,null,null,null,{"$f":"D70","v":"None"},{"$f":"IFERROR(VLOOKUP(P8,Equipment!$H$102:$I$108,2,FALSE),0)","v":0},{"$f":"E70","v":"None"},{"$f":"IFERROR(VLOOKUP(R8,Equipment!$H$102:$I$108,2,FALSE),0)","v":0},null,null,null,null,null,null,null,null,null,{"$f":"U2","v":"John Deere 6110M 4wd"},{"$f":"IFERROR(VLOOKUP(AC8,Equipment!$G$6:$AB$12,12,FALSE)+VLOOKUP(AC8,Equipment!$G$6:$AB$12,15,FALSE)+VLOOKUP(AC8,Equipment!$G$6:$AB$12,16,FALSE)+VLOOKUP(AC8,Equipment!$G$6:$AB$12,17,FALSE),0)","v":10031.461862630062},{"$f":"IFERROR(VLOOKUP(AC8,Equipment!$G$6:$AB$12,14,FALSE),0)","v":4675},null,null,null,null,null,null,null,null,null,null,null,null,null,null,null,null,null,null,"June",{"$f":"SUM(AZ25:AZ28)","v":14.899999999999999},{"$f":"SUM(BA25:BA28)","v":20.799999999999997},{"$f":"SUM(BB25:BB28)","v":22.5},{"$f":"SUM(BC25:BC28)","v":23.7},{"$f":"SUM(BD25:BD28)","v":26}]
{"$rows_left_out":185}
{"sheet":"Fertilizer","index":5,"n_rows":96,"n_cols":49,"rows_kept":96,"cut":false,"hidden":true,"merged":[[37,1,40,1],[3,1,3,5],[30,1,33,1],[28,44,28,45],[29,44,29,45],[26,43,26,45],[88,1,91,1],[54,1,54,5],[77,43,77,45],[79,44,79,45],[80,44,80,45],[81,1,84,1]]}
[]
[]
[null,null,null,null,null,null,null,null,null,null,null,null,null,null,null,null,null,null,null,null,null,null,null,null,null,null,null,null,null,null,null,null,null,null,null,"Acreage Numbers",null,"Cost of Litter Prices"]
[null,"Commerical Fertilizer cost analysis",null,null,null,null,null,null,null,null,null,null,null,null,null,null,null,null,null,null,null,null,null,null,null,null,null,null,null,null,null,null,"List of parameters",null,null,10,null,25]
[null,null,null,null,null,null,null,null,null,null,null,null,null,null,null,null,null,null,null,null,null,null,null,null,null,null,null,null,null,null,null,null,null,null,null,25,null,35]
[null,"Acres applying","Tons of fertilizer needed","Truckloads",null,"Total cost of fertilizer","Added Charge","Fertilizer + Application",null,"Diesel Fuel Price ($/gal)",{"$f":"Litter!$L$40","v":2},null,null,null,null,null,null,null,null,null,null,"Labor Cost","Pay /hr.",null,null,null,null,null,null,null,null,null,null,null,null,50,null,45]
[null,{"$f":"+Litter!B7","v":300},{"$f":"(F14+G14+H14)*B7/2000","v":24},{"$f":"ROUNDUP(C7/35,0)","v":1},null,{"$f":"SUM(F11:H11)","v":20893.96837944664},{"$f":"'User Page'!F10","v":0},{"$f":"F7+G7*B7","v":20893.96837944664},null,"N price per lb.",{"$f":"K12/2000/0.46","v":0.43547430830039519},null,null,null,null,null,null,null,null,null,null,{"$f":"J17","v":"Operator 1"},{"$f":"K17","v":22},null,null,null,null,null,null,null,null,null,null,null,null,100]
[null,null,null,null,null,null,null,null,null,"P price per lb.",{"$f":"K13/2000/0.46","v":0.49667984189723319},null,null,null,null,null,null,null,null,null,null,{"$f":"J18","v":"Operator 2"},{"$f":"K18","v":16.5},null,null,null,null,null,null,null,null,null,null,null,null,200]
{"$rows_left_out":89}
{"sheet":"Comparison","index":6,"n_rows":25,"n_cols":21,"rows_kept":25,"cut":false,"hidden":false,"merged":[[2,1,2,8],[17,7,17,8],[18,7,18,8],[10,7,10,8],[5,4,5,5],[10,1,10,2]]}
[]
[]
[null,"Summary for Comparison"]
[]
[]
[null,"Acres Fertilized",{"$f":"'User Page'!C5","v":300},null,"Desired Nutrient Content (per year in lbs./acre)",null,null,"Custom Fertilzer Fee",{"$f":"IF(Litter!T49,Litter!F63,\"N/A\")","v":"N/A"}]
[null,null,null,null,"N",{"$f":"+Litter!D14","v":60},null,"Other fees per order",{"$f":"+'User Page'!F10","v":0}]
[null,"Cost of Litter per ton",{"$f":"'User Page'!C7","v":45},null,"P",{"$f":"+Litter!E14","v":40}]
{"$rows_left_out":17}